{"text_format":"1","workbook":"xlsx","n_sheets":41,"sheets":["LDC Info","Index","COS Flowchart","List of Key References","App.2-A_Requested_Approvals","App.2-AA_Capital Projects","App.2-AB_Capital Expenditures","App.2-AC_Customer Engagement","App.2-B_Acctg Instructions","App.2-BA_Fixed Asset Cont","Appendix 2-BB Service Life  ","App.2-C_DepExp","App.2-D_Overhead","App.2-EA_Account 1575 (2015)","App.2-EB_Account 1576 (2012)","App.2-EC_Account 1576 (2013)","App.2-FA Proposed REG Invest.","App.2-FB Calc of REG Improvemnt","App.2-FC Calc of REG Expansion","App.2-G SQI","App.2-H_Other_Oper_Rev","App_2-I LF_CDM","App.2-IA_Load_Forecast_Instrct","App.2-IB_Load_Forecast_Analysis","App.2-JA_OM&A_Summary_Analys","App.2-JB_OM&A_Cost _Drivers","App.2-JC_OMA Programs","App.2-K_Employee Costs","App.2-L_OM&A_per_Cust_FTE","App.2-L_OM&A_per_Cust_FTEE_exp","App.2-M_Regulatory_Costs","App.2-N_Corp_Cost_Allocation","App.2-OA Capital Structure","App.2-OB_Debt Instruments","App.2-Q_Cost of Serv. Emb. Dx","App.2-R_Loss Factors","App.2-S_Stranded Meters","App.2-Y_MIFRS Summary Impacts","Sheet19","App.2-YA_IFRS Transition Costs","Sheet1"],"not_rendered":{"charts":0,"images":5,"macros":1,"external_links":15,"defined_names":507,"comments":4,"pivot_tables":0},"unopened":[],"bounds":{"document_bytes":16777216,"sheet_cells":100000,"rows_first":2000,"rows_last":500,"rows_between":2000,"halvings":0,"cell_chars":16384,"cell_head_chars":4096},"cells_cut":0,"cells_raw":0,"read":"whole","date_system":"1900"}

{"sheet":"LDC Info","index":0,"n_rows":77,"n_cols":27,"rows_kept":77,"cut":false,"hidden":false,"merged":[[17,4,17,10],[13,4,13,10],[15,4,15,8],[19,4,19,8],[25,4,25,6],[23,4,23,6],[21,4,21,8],[45,0,45,3],[50,2,50,11],[54,2,54,12],[52,2,52,13],[27,4,27,6],[30,4,30,6],[29,0,30,3],[42,0,43,3],[38,0,39,3],[39,4,39,6],[32,0,33,3],[33,4,33,6],[35,0,36,3]]}
[]
[]
[null,null,null,null,null,null,null,null,null,null,null,null,null,null,null,null,null,null,null,null,null,null,null,null,null,1,"Alectra Utilities Corporation"]
[null,null,null,null,null,null,null,null,null,null,null,null,null,null,null,null,null,null,null,null,null,null,null,null,null,2,"Alectra Utilities Corporation - Brampton service territory"]
[null,null,null,null,null,null,null,null,null,null,null,null,null,null,null,null,null,null,null,null,null,null,null,null,null,3,"Alectra Utilities Corporation - Horizon Utilities service territory"]
[null,null,null,null,null,null,null,null,null,null,null,null,null,null,null,null,null,null,null,null,null,null,null,null,null,4,"Alectra Utilities Corporation - Mississauga service territory"]
[null,null,null,null,null,null,null,null,null,null,null,null,null,null,null,null,null,null,null,null,null,null,null,null,null,5,"Alectra Utilities Corporation - PowerStream service territory"]
[null,null,null,null,null,null,null,null,null,null,null,null,null,null,null,null,null,null,null,null,null,null,null,null,null,6,"Algoma Power Inc."]
[null,null,null,null,null,null,null,null,null,null,null,null,null,null,null,null,null,null,null,null,null,null,null,null,null,7,"Atikokan Hydro Inc."]
[null,null,null,null,null,null,null,null,null,null,null,null,null,null,null,null,null,null,null,null,null,null,null,null,null,8,"Attawapiskat Power Corporation"]
[null,null,null,null,null,null,null,null,null,null,null,null,null,null,null,null,null,null,null,null,null,null,null,null,null,9,"Bluewater Power Distribution Corporation"]
[null,null,null,null,null,null,null,null,null,null,null,null,null,null,null,null,null,null,null,null,null,null,null,null,null,10,"Brantford Power Inc."]
[null,null,null,null,null,null,null,null,null,null,null,null,null,null,null,null,null,null,null,null,null,null,null,null,null,11,"Burlington Hydro Inc."]
[null,null,null,"Utility Name   ","Erie Thames Powerlines Corporation",null,null,null,null,null,null,null,null,null,null,null,null,null,null,null,null,null,null,null,null,12,"Canadian Niagara Power Inc. (Eastern Ontario Power/Fort Erie/Port Colborne)"]
[null,null,null,null,null,null,null,null,null,null,null,null,null,null,null,null,null,null,null,null,null,null,null,null,null,13,"Centre Wellington Hydro Ltd."]
[null,null,null,"Assigned EB Number","EB-2017-0038",null,null,null,null,null,null,null,null,null,null,null,null,null,null,null,null,null,null,null,null,14,"Chapleau Public Utilities Corporation"]
[null,null,null,null,null,null,null,null,null,null,null,null,null,null,null,null,null,null,null,null,null,null,null,null,null,15,"COLLUS PowerStream Corp."]
[null,null,null,"Name of Contact and Title","Graig Pettit, Director of Regulatory, Finance and Customer Relations",null,null,null,null,null,null,null,null,null,null,null,null,null,null,null,null,null,null,null,null,16,"Cooperative Hydro Embrun Inc."]
[null,null,null,null,null,null,null,null,null,null,null,null,null,null,null,null,null,null,null,null,null,null,null,null,null,17,"E.L.K. Energy Inc."]
[null,null,null,"Phone Number   ","519-485-1820  ext 254",null,null,null,null,null,null,null,null,null,null,null,null,null,null,null,null,null,null,null,null,18,"Energy + Inc."]
[null,null,null,null,null,null,null,null,null,null,null,null,null,null,null,null,null,null,null,null,null,null,null,null,null,19,"Enersource Hydro Mississauga Inc."]
[null,null,null,"Email Address   ","gpettit@eriethamespower.com",null,null,null,null,null,null,null,null,null,null,null,null,null,null,null,null,null,null,null,null,20,"Entegrus Powerlines Inc."]
[null,null,null,null,null,null,null,null,null,null,null,null,null,null,null,null,null,null,null,null,null,null,null,null,null,21,"ENWIN Utilities Ltd."]
[null,null,null,"Test Year",2018,null,null,null,null,null,null,null,null,null,null,null,null,null,null,null,null,null,null,null,null,22,"Erie Thames Powerlines Corporation"]
[null,null,null,null,null,null,null,null,null,null,null,null,null,null,null,null,null,null,null,null,null,null,null,null,null,23,"Espanola Regional Hydro Distribution Corporation"]
[null,null,null,"Bridge Year",{"$f":"IF(ISBLANK(E24), \"\", E24-1)","v":2017},null,null,null,null,null,null,null,null,null,null,null,null,null,null,null,null,null,null,null,null,24,"Essex Powerlines Corporation"]
[null,null,null,null,null,null,null,null,null,null,null,null,null,null,null,null,null,null,null,null,null,null,null,null,null,25,"Festival Hydro Inc."]
[null,null,null,"Last Rebasing Year",2012,null,null,null,null,null,null,null,null,null,null,null,null,null,null,null,null,null,null,null,null,26,"Fort Albany Power Corporation"]
[null,null,null,null,null,null,null,null,null,null,null,null,null,null,null,null,null,null,null,null,null,null,null,null,null,27,"Fort Frances Power Corporation"]
["Identify the accounting standard used for the test year",null,null,null,null,null,null,null,null,null,null,null,null,null,null,null,null,null,null,null,null,null,null,null,null,28,"Greater Sudbury Hydro Inc."]
[null,null,null,null,"MIFRS",null,null,null,null,null,null,null,null,null,null,null,null,null,null,null,null,null,null,null,null,29,"Grimsby Power Inc."]
[null,null,null,null,null,null,null,null,null,null,null,null,null,null,null,null,null,null,null,null,null,null,null,null,null,30,"Guelph Hydro Electric Systems Inc."]
["Did you update your depreciation and capitalization policies and reflect the changes in policies in a prior rebasing application?",null,null,null,null,null,null,null,null,null,null,null,null,null,null,null,null,null,null,null,null,null,null,null,null,31,"Halton Hills Hydro Inc."]
[null,null,null,null,"No",null,null,null,null,null,null,null,null,null,null,null,null,null,null,null,null,null,null,null,null,32,"Hearst Power Distribution Company Limited"]
[null,null,null,null,null,null,null,null,null,null,null,null,null,null,null,null,null,null,null,null,null,null,null,null,null,33,"Hydro 2000 Inc."]
["When did you update your actual depreciation and capitalization policies?",null,null,null,null,null,null,null,null,null,null,null,null,null,null,null,null,null,null,null,null,null,null,null,null,34,"Hydro Hawkesbury Inc."]
[null,null,null,null,"2001-01-01",2013,null,null,null,null,null,null,null,null,null,null,null,null,null,null,null,null,null,null,null,35,"Hydro One Networks Inc."]
[null,null,null,null,null,null,null,null,null,null,null,null,null,null,null,null,null,null,null,null,null,null,null,null,null,36,"Hydro One Networks Inc. - Norfolk, Haldimand, Woodstock"]
["Identify the year the applicant adopted IFRS for financial reporting purposes",null,null,null,null,null,null,null,null,null,null,null,null,null,null,null,null,null,null,null,null,null,null,null,null,37,"Hydro One Remote Communities Inc."]
[null,null,null,null,2015,null,null,null,null,null,null,null,null,null,null,null,null,null,null,null,null,null,null,null,null,38,"Hydro Ottawa Limited"]
[null,null,null,null,null,null,null,null,null,null,null,null,null,null,null,null,null,null,null,null,null,null,null,null,null,39,"Innpower Corporation"]
[null,null,null,null,null,null,null,null,null,null,null,null,null,null,null,null,null,null,null,null,null,null,null,null,null,40,"Kashechewan Power Corporation"]
["Are you applying for cost recovery for the test and/or future year(s) for Green Energy initiatives?",null,null,null,null,null,null,null,null,null,null,null,null,null,null,null,null,null,null,null,null,null,null,null,null,41,"Kenora Hydro Electric Corporation Ltd."]
[null,null,null,null,"No",null,null,null,null,null,null,null,null,null,null,null,null,null,null,null,null,null,null,null,null,42,"Kingston Hydro Corporation"]
[null,null,null,null,null,null,null,null,null,null,null,null,null,null,null,null,null,null,null,null,null,null,null,null,null,43,"Kitchener-Wilmot Hydro Inc."]
[{"$f":"\"Is \" & E14 & \" an embedded distributor?\"","v":"Is Erie Thames Powerlines Corporation an embedded distributor?"},null,null,null,"Yes",null,null,null,null,null,null,null,null,null,null,null,null,null,null,null,null,null,null,null,null,44,"Lakefront Utilities Inc."]
[null,null,null,null,null,null,null,null,null,null,null,null,null,null,null,null,null,null,null,null,null,null,null,null,null,45,"Lakeland Power Distribution Ltd."]
[null,null,null,null,null,null,null,null,null,null,null,null,null,null,null,null,null,null,null,null,null,null,null,null,null,46,"London Hydro Inc."]
[null,"Notes",null,null,null,null,null,null,null,null,null,null,null,null,null,null,null,null,null,null,null,null,null,null,null,47,"Midland Power Utility Corporation"]
[null,null,null,null,null,null,null,null,null,null,null,null,null,null,null,null,null,null,null,null,null,null,null,null,null,48,"Milton Hydro Distribution Inc."]
[null,null,"Pale green cells represent input cells.",null,null,null,null,null,null,null,null,null,null,null,null,null,null,null,null,null,null,null,null,null,null,49,"Newmarket-Tay Power Distribution Ltd."]
[null,null,null,null,null,null,null,null,null,null,null,null,null,null,null,null,null,null,null,null,null,null,null,null,null,50,"Niagara Peninsula Energy Inc."]
[null,null,"Pale blue cells represent drop-down lists.  The applicant should select the appropriate item from the drop-down list.",null,null,null,null,null,null,null,null,null,null,null,null,null,null,null,null,null,null,null,null,null,null,51,"Niagara-on-the-Lake Hydro Inc."]
[null,null,null,null,null,null,null,null,null,null,null,null,null,null,null,null,null,null,null,null,null,null,null,null,null,52,"North Bay Hydro Distribution Limited"]
[null,null,"White cells contain fixed values, automatically generated values or formulae. ",null,null,null,null,null,null,null,null,null,null,{"$f":"IF(LEN($G55)>1, (SUMPRODUCT(--($C$78:$C$1000=$C55),--($A$78:$A$1000=$D55), --($B$78:$B$1000=$B55&\"_TOTAL\"), $L$78:$L$1000)), \"\")","v":""},{"$f":"IF(LEN($G55)>1, (SUMPRODUCT(--($C$78:$C$1000=$C55),--($A$78:$A$1000=$D55), --($B$78:$B$1000=$B55&\"_TOTAL\"), $M$78:$M$1000)), \"\")","v":""},null,null,null,null,null,null,null,null,null,null,53,"Northern Ontario Wires Inc."]
[null,null,null,null,null,null,null,null,null,null,null,null,null,{"$f":"IF(LEN($G56)>1, (SUMPRODUCT(--($C$78:$C$1000=$C56),--($A$78:$A$1000=$D56), --($B$78:$B$1000=$B56&\"_TOTAL\"), $L$78:$L$1000)), \"\")","v":""},{"$f":"IF(LEN($G56)>1, (SUMPRODUCT(--($C$78:$C$1000=$C56),--($A$78:$A$1000=$D56), --($B$78:$B$1000=$B56&\"_TOTAL\"), $M$78:$M$1000)), \"\")","v":""},null,null,null,null,null,null,null,null,null,null,54,"Oakville Hydro Electricity Distribution Inc."]
[null,null,null,null,null,null,null,null,null,null,null,null,null,"","",null,null,null,null,null,null,null,null,null,null,55,"Orangeville Hydro Limited"]
[null,null,null,null,null,null,null,null,null,null,null,null,null,"","",null,null,null,null,null,null,null,null,null,null,56,"Orillia Power Distribution Corporation"]
[null,null,null,null,null,null,null,null,null,null,null,null,null,"","",null,null,null,null,null,null,null,null,null,null,57,"Oshawa PUC Networks Inc."]
[null,null,null,null,null,null,null,null,null,null,null,null,null,"","",null,null,null,null,null,null,null,null,null,null,58,"Ottawa River Power Corporation"]
[null,null,null,null,null,null,null,null,null,null,null,null,null,"","",null,null,null,null,null,null,null,null,null,null,59,"Peterborough Distribution Inc."]
[null,null,null,null,null,null,null,null,null,null,null,null,null,"","",null,null,null,null,null,null,null,null,null,null,60,"PUC Distribution Inc."]
[null,null,null,null,null,null,null,null,null,null,null,null,null,"","",null,null,null,null,null,null,null,null,null,null,61,"Renfrew Hydro Inc."]
[null,null,null,null,null,null,null,null,null,null,null,null,null,"","",null,null,null,null,null,null,null,null,null,null,62,"Rideau St. Lawrence Distribution Inc."]
[null,null,null,null,null,null,null,null,null,null,null,null,null,"","",null,null,null,null,null,null,null,null,null,null,63,"Sioux Lookout Hydro Inc."]
[null,null,null,null,null,null,null,null,null,null,null,null,null,"","",null,null,null,null,null,null,null,null,null,null,64,"St. Thomas Energy Inc."]
[null,null,null,null,null,null,null,null,null,null,null,null,null,"","",null,null,null,null,null,null,null,null,null,null,65,"Thunder Bay Hydro Electricity Distribution Inc."]
[null,null,null,null,null,null,null,null,null,null,null,null,null,"","",null,null,null,null,null,null,null,null,null,null,66,"Tillsonburg Hydro Inc."]
[null,null,null,null,null,null,null,null,null,null,null,null,null,"","",null,null,null,null,null,null,null,null,null,null,67,"Toronto Hydro-Electric System Limited"]
[null,null,null,null,null,null,null,null,null,null,null,null,null,"","",null,null,null,null,null,null,null,null,null,null,68,"Veridian Connections Inc."]
[null,null,null,null,null,null,null,null,null,null,null,null,null,"","",null,null,null,null,null,null,null,null,null,null,69,"Wasaga Distribution Inc."]
[null,null,null,null,null,null,null,null,null,null,null,null,null,"","",null,null,null,null,null,null,null,null,null,null,70,"Waterloo North Hydro Inc."]
[null,null,null,null,null,null,null,null,null,null,null,null,null,"","",null,null,null,null,null,null,null,null,null,null,71,"Welland Hydro-Electric System Corp."]
[null,null,null,null,null,null,null,null,null,null,null,null,null,"","",null,null,null,null,null,null,null,null,null,null,72,"Wellington North Power Inc."]
[null,null,null,null,null,null,null,null,null,null,null,null,null,null,null,null,null,null,null,null,null,null,null,null,null,73,"West Coast Huron Energy Inc."]
[null,null,null,null,null,null,null,null,null,null,null,null,null,null,null,null,null,null,null,null,null,null,null,null,null,74,"Westario Power Inc."]
[null,null,null,null,null,null,null,null,null,null,null,null,null,null,null,null,null,null,null,null,null,null,null,null,null,75,"Whitby Hydro Electric Corporation"]

{"sheet":"Index","index":1,"n_rows":42,"n_cols":6,"rows_kept":42,"cut":false,"hidden":false,"merged":[[41,1,41,5]]}
[]
[]
[]
[]
[]
[]
[]
[]
[]
[]
[]
[]
[]
[]
[1,"LDC Information Sheet",null,null,20,"App.2-G: Service Reliability Indicators"]
[2,"Index",null,null,21,"App.2-H: Other Operating Revenue"]
[3,"Cost of Service Application Flowchart",null,null,22,"App.2-I: Load Forecast CDM Adjustment Workform"]
[4,"List of Key References",null,null,23,"App.2-IA: Load Forecast Data Instructions"]
[5,"App.2-A: List of Requested Approvals",null,null,24,"App.2-IB:  Actual and Forecast Load and Customer Data"]
[6,"App.2-AA: Capital Projects Table",null,null,25,"App.2-JA: OM&A Summary Analysis"]
[7,"App.2-AB: Capital Expenditures",null,null,26,"App.2-JB: Recoverable OM&A Cost Driver Table"]
[8,"App. 2-AC: Customer Engagement Worksheet",null,null,27,"App.2-JC: OM&A Programs Table"]
[9,"App.2-B: General Accounting Instructions",null,null,28,"App.2-K: Employee Costs"]
[10,"App.2-BA: Fixed Asset Continuity Schedule",null,null,29,"App.2-L: Recoverable OM&A Cost per Customer and per FTE"]
[11,"Appendix 2-BB: Service Life Comparison",null,null,30,"App.2-M: Regulatory Costs Schedule"]
[12,"App.2-C_DepExp: Depreciation and Amortization Expense",null,null,31,"App.2-N: Shared Services and Corporate Cost Allocation"]
[13,"App.2-D: Overhead Expenses",null,null,32,"App.2-OA: Capital Structure and Cost of Capital"]
[14,"App.2-EA: Account 1575 PP&E Deferral Account (2015 IFRS Adopters)",null,null,33,"App.2-OB: Debt Instruments"]
[15,"App.2-EB: Account 1576 - Accounting Changes Under CGAAP (2012 Changes)",null,null,34,"App.2-Q: Cost of Serving Embedded Distributor(s)"]
[16,"App.2-EC: Account 1576 - Accounting Changes Under CGAAP (2013 Changes)",null,null,35,"App.2-R: Loss Factors"]
[17,"App.2-FA: Renewable Generation Connection Investment Summary",null,null,36,"App.2-S: Stranded Meter Treatment"]
[18,"App.2-FB: Calculation of Renewable Generation Connection Direct Benefits/Provincial Amount: Renewable Enabling Improvement Investments",null,null,37,"App.2-Y: Transition to MIFRS Summary Impact"]
[19,"App.2-FC: Calculation of Renewable Generation Connection Direct Benefits/Provincial Amount: Renewable Expansion Investments",null,null,38,"App.2-YA: One-Time Incremental IFRS Transition Costs"]
[]
[]
[]
[]
[]
[]
[]
[]
["Note:","Appendices for the Tariff of Rates and Charges at Current and Proposed Rates, and for the Bill Impacts are now in a separate spreadsheet model. These appendices were formerly 2-Z and 2-W."]

{"sheet":"COS Flowchart","index":2,"n_rows":6,"n_cols":2,"rows_kept":6,"cut":false,"hidden":false,"merged":[[5,1,5,6],[2,1,2,6],[3,1,3,6]]}
[]
[]
[]
[null,"Cost of Service Rate Application Schematic"]
[]
[null,"The Cost of Service Rate Application Schematic is a flowchart that is included as a guide for the components of an application. The schematic demonstrates how demand and costs interrelate to derive the revenue requirement and how the revenue requirement is allocated between classes and through fixed/variable splits to derive rates that will be compensatory for the annual revenue requirement, based on the the forecasted demand.  There is no form to be filled out; therefore, this Schedule is not required to be filed."]

{"sheet":"List of Key References","index":3,"n_rows":5,"n_cols":2,"rows_kept":5,"cut":false,"hidden":false,"merged":[[2,1,2,11],[4,0,4,11]]}
[]
[]
[null,"List of Key References"]
[]
["A list of key references for understanding the Filing Requirements has been embedded in the document below. To access the list of references and associated hyperlinks double-click the icon below."]

{"sheet":"App.2-A_Requested_Approvals","index":4,"n_rows":34,"n_cols":8,"rows_kept":34,"cut":false,"hidden":false,"merged":[[41,5,41,7],[11,1,11,7],[29,5,29,7],[23,5,23,7],[25,5,25,7],[27,5,27,7],[31,5,31,7],[21,5,21,7],[13,1,13,7],[15,1,15,7],[17,1,17,7],[19,5,19,7],[8,1,8,7],[33,5,33,7],[35,5,35,7],[37,5,37,7],[39,5,39,7],[9,1,9,7]]}
[null,null,null,null,null,null,"File Number:",{"$f":"EBNUMBER","v":"EB-2017-0038"}]
[null,null,null,null,null,null,"Exhibit:",1]
[null,null,null,null,null,null,"Tab:",2]
[null,null,null,null,null,null,"Schedule:"]
[null,null,null,null,null,null,"Page:",19]
[]
[null,null,null,null,null,null,"Date:","Sept 12, 2017"]
[]
[null,"Appendix 2-A"]
[null,"List of Requested Approvals"]
[]
[null,"The distributor must fill out the following sheet with the complete list of specific approvals requested and relevant section(s) of the legislation must be provided. All approvals, including accounting orders (deferral and variance accounts) new rate classes, revised specific service charges or retail service charges which the applicant is seeking, must be separately identified, as well being clearly documented in the appropriate sections of the application."]
[]
[null,"Additional requests may be added by copying and pasting blank input rows, as needed."]
[]
[null,"If additional requests arise, or requested approvals are removed, during the processing of the application, the distributor should update this list."]
[]
[null,{"$f":"CONCATENATE('LDC Info'!E14,\" is seeking the following approvals in this application:\")","v":"Erie Thames Powerlines Corporation is seeking the following approvals in this application:"}]
[]
[null,1,null,null,null,"Approval to charge distribution rates effective May 1st, 2018 to recover a revenue requirement of $10,785,164 utilizing the proposed rates detailed in Exhibit 8."]
[]
[null,2,null,null,null,"Approval of ETPL's distribution system plan as provided in Attachment 2 C of Exhibit 2."]
[]
[null,3,null,null,null,"Approval for updated Retail Transmission Rates as detailed in Exhibit 8 and the Excel RTSR workform"]
[]
[null,4,null,null,null,"Approval of the revised loss factors as detailed in Exhibit 8"]
[]
[null,5,null,null,null,"Approval of Wholesale Market Service Rates (with CBDR Split) and revised Rural and Remote Rate Protection Charges as detailed in Exhibit 8"]
[]
[null,6,null,null,null,"Approval to continue billing Specific Service Charges, Retail Service Charges and Transformer Ownership Allowances as approved in ETPL's 2017 IRM application EB-2016-0068."]
[]
[null,7,null,null,null,"Approval to dispose of Group 1, Group 2 and Other DVA accounts as detailed in Exhibit 9."]
[]
[null,8,null,null,null,"Approval to continue the transition of residential rates to fully fixed charges as detailed in Exhibit 8"]

{"sheet":"App.2-AA_Capital Projects","index":5,"n_rows":131,"n_cols":8,"rows_kept":131,"cut":false,"hidden":false,"merged":[[8,0,8,7],[131,0,131,7],[130,0,130,7],[129,0,129,7],[11,0,11,7],[9,0,9,7]]}
[null,null,null,null,null,null,"File Number:",{"$f":"EBNUMBER","v":"EB-2017-0038"}]
[null,null,null,null,null,null,"Exhibit:",2]
[null,null,null,null,null,null,"Tab:",2]
[null,null,null,null,null,null,"Schedule:",1]
[null,null,null,null,null,null,"Page:",27]
[]
[null,null,null,null,null,null,"Date:","Sept 12, 2017"]
[]
["Appendix 2-AA"]
["Capital Projects Table"]
[]
[]
["Projects",2013,2014,2015,2016,"2017 Bridge Year","2018 Test Year"]
["Reporting Basis","CGAAP","MIFRS","MIFRS","MIFRS","MIFRS","MIFRS"]
["System Access"]
["Comm & Ind Connections",110247.62685536704,199891.83971621576,251973.90006622521,192895.16370483712,204000,204000]
["Residential Connections",41910.416607859923,377855.74248812319,395110.8116110664,371235.57834902348,231000,231000]
["Munc Road Reconstruction",70551.380338074669,123310.00308603526,452380.18880542921,229747.01638724108]
["Subdivisions",104545.58384661883,402881.77470962598,140002.301477495,110037.08270211978]
["Joint Use Make Ready Work",933.4899999999999,0,0,14043.979999999998]
["Meter Stock Purchases",57722.94,151357.35999999999,73325.419999999824,142345.24000000002,248628,234500]
["MIT-EXPN-3878 WELLINGTON ST.",12719.019999999999,0,0,0]
["AYL-FACRL-84 SOUTH ST. W.",2473.3900000000003,0,0,0]
["ING-FACRL-HOLCROFT ST.",312060.07999999967,1663.85,0,0]
["ING-FACRL-CHARLES ST.W.",3914.5199999999995,24339.42000000002,0,0]
["TAVI-FACRL-79 MARIA ST.",40237.959999999985,0,0,0]
["BEL-FACRL-Belmont PME",828.68000000000006,0,0,0]
["ING-FACRL-Holcroft St Rail Xing",null,87643.359999999913,0,0]
["PTS-FACRL-Mitchell St",null,1959.56,0,0]
["THA-FACRL-CHRISTIAN RETREAT",null,32483.650000000012,0,0]
["CLI-SRVCI-270 Victoria St",0,17068.439999999995,0,0]
["TAV-FACRL-117 Hope St",null,0,3225.1999999999994,0]
["Facility Relocates",null,0,0,0,50000,150000]
[null,null,0,0,0]
[null,0,0,0,0]
[null,0,0,0,0]
["Miscellaneous",164.91235208018679,0,950.19,0]
["Sub-Total",{"$f":"SUM(B16:B37)","v":758310.00000000035},{"$f":"SUM(C16:C37)","v":1420455},1316968.0119602156,1060304.0611432213,733628,819500]
["System Renewal"]
["TAV-EXPN-WILLIAM ST.",14360.331720351211,0,0,0]
["TAV-UGUPG-JACOB ST.",8925.3564763849608,0,0,0]
["BEL-REPL FAC-HAZELWOOD UG UPG",60786.588143130393,0,0,0]
["ING-REPL FAC-MELITA & WONHAM",97003.17610610876,0,0,0]
["CLI-TXCVN-MAPLEHILL APTS",12769.479472946623,0,0,0]
["AYL-Fath Ave Rear Yard",58172.743769865585,10814.586657858817,0,0]
["ING-GOLDEN GARDENS",126980.55703116552,22912.1618245153,0,0]
["TAV-CONUIT-HOPE & CENTENNIAL",1437.2640721780165,0,0,0]
["PTS-GEORGE ST/RIVER/VALLEY/LAK",12372.600364150876,428520.07458377199,38990.781829158346,-8021.0418586091037]
["OTT-27OHRECON-DOVER ST.",null,20246.867198148768,0,0]
["MIT-OHUPG-NAPIER & CLAYTON",null,94998.155812566343,0,0]
["TAV-UGUPG-ARENA & SCHOOL",null,36093.48383390002,0,0]
["BEL-FACRL-Belmont PME",null,65618.61697141896,0,0]
["NOR-OHUPG-STOVER ST N",null,285371.30522241292,728.34963000873518,0]
["CLI-27OHCVN-VICTORIA ST.",null,null,13282.768362112591,0]
["ING-UGRECON-UNDERWOOD AVE-PLLN",null,null,56524.408333676867,73875.26381215216]
["PTS-OHUPGD-473 LOWER SPRING ST",null,null,6590.1498881623738,0]
["TAV-REPLCON-WILLIAM ST.SEWPUMP",null,null,5093.039698737407,0]
["AYL-OHUPG-207 Talbot St E",null,null,1078.0006505768065,-991.57712097534204]
["BEL-FACRL-140 Borden Ave",null,null,0,1991.3787939949571]
["PTS-FACRL-Edith Cavell Blvd. E.",null,null,0,140085.75641446223]
["ING-FACRL-205 INGERSOLL ST. S",null,null,null,14788.745253782292]
["NOR-OHUPF-Municipal Supply Upgr",null,null,null,3948.690704566744]
["THA-REPLACE FAULTED RABBIT-",null,null,null,7896.2711676497165]
["CLI-EXPN-Mary St",null,null,null,3183.4786745363967]
["ING-REPL SYNERTEC-325 INGERSOLL",null,null,0,710.97089017175824]
["AYL-LDISP-89 Progress Dr (IGPC)",null,null,null,14256.866540851672]
["ING-OGCONV-Bruce & Metcalfe",null,null,null,null,null,295000]
["AYL-OHCONV-BMO & Comm Living",null,null,null,null,null,135240]
["AYL-ONCONV-Myrtle to John w/ pool",null,null,null,null,null,258840]
["AYL-OHCONV-Caverly RD, Anne to Fath",null,null,null,null,null,82200]
["AYL-UGCONV-Davenport School",null,null,null,null,null,105450]
["PTS-OHUPGD-George St Completion",null,null,null,null,null,60000]
["AYL-OHCONV-Talbot, Myrtle to Wellington",null,null,null,null,null,200120]
["CLI-OHCONV-Princess, Percival to Schools",null,null,null,null,null,161400]
["MIT-UGCONV-St Andrew & Maple Crt",null,null,null,null,null,188472]
["MIT-OHCONV-Step Down TX, Arthur St.",null,null,null,null,null,46000]
["CLI-OHCONV-Princess, Percival to William St",null,null,null,null,null,241728]
["BEA-OHCON-Station Egress and Crossing",null,null,null,null,120000]
["TAV-STNUPG-Station Upgrades (PH2)",null,null,null,null,100000]
["OTT-OHUPG-Grove & Maple",null,null,null,null,110292]
["AYL-UGCONV-Talbot St. E.-King to Queen",null,null,null,null,185000]
["AYL-STATION-New Feeder Egress & PME",null,null,null,null,304200]
["AYL-OHCONV-South Street, Caverly to Rutherford",null,null,null,null,132000]
["CLI-OHCONV-Bayfield Road",null,null,null,null,274500]
[]
[]
["Service Upgrades",0,0,0,63119.353880654176,50000]
["Conversions",218829.98094489024,735463.25539856893,1288617.2531033647,701865.71941690473]
["SubStation Upgrades",12222.187765624329,4681.3161297280158,85828.811878694061,56970.785413971891,15000,8000]
["Replacement - Poles",71612.901157357905,62883.172577936552,133129.64990381,176409.07417743743,123000,200000]
["Replacement - Transformers",15294.791292738328,11336.423952887917,52935.053839013533,50464.857969699879]
["Replacement - Insulators",8103.0666247119825,262168.81782805751,0,0]
["Replacement - Switches",0,0,0,48154.744914998024,50000]
["Replacement - Primary",7529.952720309132,0,4939.0271273366598,0]
["Replacement - Secondary",690.40630618505281,0,0,0]
[null,0,0,0,0]
["Emergencies - Storm",8721.3329568418012,8754.2244371948182,13840.66788409776,13593.365778331543]
["Emergencies - Misc",13455.122414081659,52103.888221833302,24845.296901194153,29060.461274479414]
[]
["Unplanned Capital Investments",null,null,null,null,150000,100000]
[null,0,0,0,0]
["Maps & Records",40129.160660977628,196285.64934919952,104062.74097005611,124401.60870823587,120000,120000]
[null,null,0,null,0]
["Miscellaneous",null,0,null,-132.31595051687844]
["Sub-Total",{"$f":"SUM(B40:B104)","v":789397},{"$f":"SUM(C40:C104)","v":2298252},1830486,1515632.4588567798,1733992,2202450]
["System Service"]
["Smart Grid, SCADA & Automation",42216,3856,64232,188030,50000,90000]
["AYL-NEW HYDRO ONE TS",null,null,null,null,383343]
[]
[]
[]
["Sub-Total",{"$f":"SUM(B107:B111)","v":42216},{"$f":"SUM(C107:C111)","v":3856},64232,188030,433343,90000]
["General Plant"]
["Leasehold Improvements",57278.73,49451.26999999999,132938.71,41813.15,49000,35000]
["Rolling Stock",386631.99,137333.99999999991,371567.75000000017,347832.25,135000,20000]
["Computer Hardware",57213.91,34018.25,11372.01999999999,22003.13,79950,56000]
["Computer Software",54670.75,87557.439999999944,218360.80000000005,27000.43]
["Tools",16441.830000000002,23803.409999999974,28870.850000000006,15489.42,35000,20000]
["Communications Equipment",null,null,null,31915.4]
["New Shop built in Mitchell",null,null,null,null,350000]
["Miscellaneous"]
["Sub-Total",{"$f":"SUM(B114:B121)","v":572237.21},{"$f":"SUM(C114:C121)","v":332164.36999999982},763110.13000000024,486053.78,648950,131000]
["Miscellaneous"]
["Total",{"$f":"B122+B112+B105+B38","v":2162160.2100000004},{"$f":"C122+C112+C105+C38","v":4054727.3699999996},3974796.1419602158,{"$f":"E122+E112+E105+E38","v":3250020.3000000012},3549913,3242950]
["Less Renewable Generation Facility Assets and Other Non-Rate-Regulated Utility Assets (input as negative)"]
["Total",{"$f":"B124-B125","v":2162160.2100000004},{"$f":"C124-C125","v":4054727.3699999996},3974796.1419602158,3250020.3000000012,3549913,3242950]
[]
["Notes:"]
[]
["1   Please provide a breakdown of the major components of each capital project undertaken in each year.  Please ensure that all projects below the materiality threshold are included in the miscellaneous line.  Add more projects as required."]
["2   The applicant should group projects appropriately and avoid presentations that result in classification of significant components of the capital budget in the miscellaneous category."]

{"sheet":"App.2-AB_Capital Expenditures","index":6,"n_rows":35,"n_cols":21,"rows_kept":35,"cut":false,"hidden":false,"merged":[[8,0,8,20],[9,0,9,20],[13,7,13,9],[13,10,13,12],[13,13,13,15],[13,16,14,16],[13,17,14,17],[15,16,15,20],[12,0,15,0],[12,1,12,15],[15,1,15,2],[15,4,15,5],[15,7,15,8],[15,10,15,11],[15,13,15,14],[12,16,12,20],[13,1,13,3],[13,4,13,6],[13,18,14,18],[13,19,14,19],[13,20,14,20],[24,0,24,20],[32,0,33,20],[35,0,36,20],[34,0,34,20],[27,0,27,20],[28,0,28,20],[29,0,30,20],[31,0,31,20],[25,0,25,7]]}
[null,null,null,null,null,null,null,null,null,null,null,null,null,null,null,null,null,null,"File Number:",null,{"$f":"EBNUMBER","v":"EB-2017-0038"}]
[null,null,null,null,null,null,null,null,null,null,null,null,null,null,null,null,null,null,"Exhibit:",null,2]
[null,null,null,null,null,null,null,null,null,null,null,null,null,null,null,null,null,null,"Tab:",null,5]
[null,null,null,null,null,null,null,null,null,null,null,null,null,null,null,null,null,null,"Schedule:"]
[null,null,null,null,null,null,null,null,null,null,null,null,null,null,null,null,null,null,"Page:",null,49]
[]
[null,null,null,null,null,null,null,null,null,null,null,null,null,null,null,null,null,null,"Date:",null,"Sept 12, 2017"]
[]
["Appendix 2-AB"]
["Table 2 - Capital Expenditure Summary from Chapter 5 Consolidated\nDistribution System Plan Filing Requirements"]
[]
["First year of Forecast Period:",{"$f":"TestYear","v":2018}]
["CATEGORY","Historical Period (previous plan1 & actual)",null,null,null,null,null,null,null,null,null,null,null,null,null,null,"Forecast Period (planned)"]
[null,{"$f":"E14-1","v":2013},null,null,{"$f":"H14-1","v":2014},null,null,{"$f":"K14-1","v":2015},null,null,{"$f":"N14-1","v":2016},null,null,{"$f":"Q14-1","v":2017},null,null,{"$f":"B12","v":2018},{"$f":"Q14+1","v":2019},{"$f":"R14+1","v":2020},{"$f":"S14+1","v":2021},{"$f":"T14+1","v":2022}]
[null,"Plan","Actual","Var","Plan","Actual","Var","Plan","Actual","Var","Plan","Actual","Var","Plan","Actual2","Var"]
[null,"$ '000",null,"%","$ '000",null,"%","$ '000",null,"%","$ '000",null,"%","$ '000",null,"%","$ '000"]
["System Access",560000,758310,{"$f":"IF(ISERROR((C17-B17)/B17),\"--\",(C17-B17)/B17)","v":0.35412500000000002},405000,1420455,{"$f":"IF(ISERROR((F17-E17)/E17),\"--\",(F17-E17)/E17)","v":2.5072962962962961},680220,1316968,{"$f":"IF(ISERROR((I17-H17)/H17),\"--\",(I17-H17)/H17)","v":0.93609126459086767},806021,1060304.0611432213,{"$f":"IF(ISERROR((L17-K17)/K17),\"--\",(L17-K17)/K17)","v":0.31547944922430227},793628,null,{"$f":"IF(ISERROR((O17-N17)/N17),\"--\",(O17-N17)/N17)","v":-1},879500,920100,812700,816300,759900]
["System Renewal",1986000,789397,-0.60251913393756296,2198000,2298252,4.5610555050045493E-2,1995440,1830486,-8.2665477288217132E-2,1978591,1515632.4588567798,-0.23398395178347631,1673992,null,-1,2142450,2002230,1907040,2168882,1939454]
["System Service",275775,42215,-0.84692230985404771,225000,3856,-0.98286222222222219,530000,64232,-0.87880754716981135,253430,188030,-0.25805942469320919,448318,null,-1,73000,74875,76750,55900,55000]
["General Plant",470000,572239,0.21752978723404257,425000,332164,-0.21843764705882354,468250,763110,0.62970635344367321,558900,486053.78,-0.13033855788155299,633975,null,-1,148000,234875,451750,223400,526450]
["TOTAL EXPENDITURE",{"$f":"SUM(B17:B20)","v":3291775},{"$f":"SUM(C17:C20)","v":2162161},-0.3431625794594102,3253000,4054727,0.24645773132493085,3673910,3974796,8.1898032341565258E-2,3596942,3250020.3000000017,-9.644906701303449E-2,3549913,0,-1,3242950,3232080,3248240,3264482,{"$f":"SUM(U17:U20)","v":3280804}]
["System O&M",null,null,"--",null,null,"--",null,null,"--",null,null,"--",null,{"$f":"(C22+F22+I22+L22)/4*1.01","v":0},"--",116388.74299953,{"$f":"Q22*1.01","v":117552.63042952531},{"$f":"R22*1.01","v":118728.15673382056},119915.43830115878,121114.59268417036]
[]
["Notes to the Table:"]
["1. Historical “previous plan” data is not required unless a plan has previously been filed. However, use the last Board-approved, at least on a Total (Capital) Expenditure basis for the last cost of service rebasing year, and the applicant should include their planned budget in each subsequent historical year up to and including the Bridge Year."]
["2. Indicate the number of months of 'actual' data included in the last year of the Historical Period (normally a 'bridge' year):",null,null,null,null,null,null,null,null,8]
[]
["Explanatory Notes on Variances (complete only if applicable)"]
["Notes on shifts in forecast vs. historical budgets by category"]
[]
[]
["Notes on year over year Plan vs. Actual variances for Total Expenditures"]
[]
[]
["Notes on Plan vs. Actual variance trends for individual expenditure categories"]

{"sheet":"App.2-AC_Customer Engagement","index":7,"n_rows":51,"n_cols":3,"rows_kept":51,"cut":false,"hidden":false,"merged":[[9,0,9,2],[8,0,8,2]]}
[null,"File Number:",{"$f":"EBNUMBER","v":"EB-2017-0038"}]
[null,"Exhibit:",1]
[null,"Tab:",5]
[null,"Schedule:",1]
[null,"Page:",35]
[]
[null,"Date:","Sept 12, 2017"]
[]
["Appendix 2-AC"]
["Customer Engagement Activities Summary"]
[]
["Provide a list of customer engagement activities","Provide a list of customer needs and preferences identified through each engagement activity","Actions taken to respond to identified needs and preferences.  If no action was taken, explain why."]
["Residential & Small Business Customer Surveys","- Cost of Electricity; reliability of electricity","ETPL is maintaining a relatively flat level of capital spending aim at maintaining the existing level of reliability."]
[]
["Large Customer/Group Consultations","Reliability, Power Quality","ETPL has met with directly with its 5 largest customers on an individual basis to understand their needs and concerns with respect to the supply and delivery of electricity to their business. ETPL has worked diligently over the years to improve power quality, reliability and in some cases redundancy to ensure the customer's needs are met."]
[]
["Municipal Planning Committee","Municipal driven projects being planned-  work with all 9 municipalites in which ETPL operates","ETPL manages its customer spend and coordinates its activities with respect to planned work being performed to ensure lack of duplicate effort and makes every effort to renew distribution assets where road widening and or sewer replacements are scheduled."]
[]
[]
["Website","- access to current usage and cost dat\n- conservation information\n- contact information in case of emergency, bill payment issues and general questions\n- links to related sites","ETPL’s website provides a substantial amount of information to our customer, with relation to their utility bills, services available to customer, rates and how bills are calculated, scheduled power outages, conservation, generation, and electrical safety. We also help to promote community events, and general industry information, as well as our RRFE scorecard."]
[]
["Bill inserts and Bill notes","- current programs available to save energy\n- conservation programs and coupons available\n","ETPL takes advantage of our ability to provide information to our customers both through the use of bill inserts and bill notes"]
[]
["Electrical Safety and Community Events","- general safety guidelines for homeowners and contractors\n- educational information for primary school children\n- seasonal saftety reminders","For several years ETPL has been providing a yearly Electrical Safety program to the Elementary School students within our own territory. We have a service provider go into the class room and demonstrate electrical risks and safety actions to be taken. We have always had a great response from the schools within our service territory, and attempt to cycle through all the schools at least once every four years.  We also attend various community events such as The Future Oxford Expo where we provide safety tips, and conservation program information."]
[]
["Conservation and Demand Management","- reduction of consumption of electricity\n","Our Conservation and Demand Management team is quite active in engaging our customers on a regular basis. We are in regular contact with our largest user (GM-CAMI Automotive) working together to find ways to conserve and review new technical opportunities that would improve their operations.  We also hold topic specific meeting, such as our Compressed Air Efficiencies and Incentives Seminar held in May 2015. Commercial/Industrial customers that use compressed air were invited to attend a meeting which we hosted to discuss how to make compressed air systems more efficient and the incentives available from the save on energy program."]
[]
["Customer Surveys","- decrease cost of electricity\n- sustain reliability of electricity\n- sustain quality of electricity","ETPL has completed customer surveys in both 2014 & 2016 and will continue this trend moving forward to obtain valuable information regarding customer satisfaction, knowledge and preferences surrounding their electricity supply. Each additional survey will allow ETPL to trend customer satisfaction and make adjustments to its distribution system plan if warranted. A complete report detailing the results of each customer survey is included in Appendix A & B.   ETPL began surveying customers on a yearly basis in 2014. The premise of our first survey was to identify our customers’ preferences regarding the existing level of service reliability and costs, and was targeted at our residential and small business classes.    The 2016 survey was again used to collect data from customers regarding their satisfaction, knowledge and preferences however in addition was used to provide customers with a better understanding of where ETPL fits within the provincial electricity system and found that the majority of customers do not have a great understanding of the system and what Erie Thames controls and does not control.  ETPL had 1136 customers respond to the customer survey in 2016 as compared to 897 in the 2014 customer survey. The 2014 survey did not use email as a medium and found that the number of responses jumped substantially when customers were contacted via email in 2016.  The surveys as a whole shows our customers are satisfied with the level of service which they receive from ETPL and feel that we are managing costs effectively. Both surveys reflect that customers are most concerned with total price and reliability, with the majority of respondents indicating that they find the existing level of reliability to be acceptable. These results are reflected in the DSP with a relatively flat level of capital spending aimed at maintaining the existing level of reliability."]
[]
["Community Involvement","-electrical safety education\n- electrical conservation\n- ","ETPL attends various community events to promote electrical safety and energy saving initiatives. ETPL presence at community events provides an informal forum for customers to speak with various levels of staff and discuss any concerns they may have."]
[]
["Communications through Call Center, and emails to general information email","- account information, ie- balance owing\n- service requests\n- outage details","Various customer inquiries, complaints and other concerns are documented and assigned to engineering, operations or customer service staff for remediation. Typically communications are related to very specific issues that are addressed immediately if possible."]
[]
["Communications directly through Engineering and Operations Department","- new service requests\n- maintenance requests\n - new developments (ie subdivision, municial infrastructure)\n ","The majority of contact directly through engineering and operations revolves around new service or service upgrade requests. These are typically forwarded to the Call Center to ensure that a proper service order is created for tracking purposes. Any customer concerns are generally addressed immediately or documented for input into capital plans as required. Prior to starting a project that may directly impact customers, written notices are given to customers identifying the scope of the project, potential impact to them (short outages to transfer services, excavations in front of their property, traffic flow changes, etc.), and contact information if they have questions or concerns."]
[]
["Social Media","- general information\n- conservation information\n- outage details\n- industry news\n","ETPL Facebook and Twitter accounts are monitored to obtain general feedback from customers."]
[]
["Meetings and Information Sessions",null,"Engineering and Operations staff meets with various customers throughout a given year for various reasons including, customers’ requests, effects of ETPL capital projects, or yearly planned meetings."]
[]
["CDM Activities",null,"CDM staff regularly initiates contact with medium to large commercial and industrial customers to discuss various initiatives through face-to-face meetings and information sessions. Discussion surrounding distribution related concerns are welcomed and communicated with engineering and operations staff."]
[]
["Corporate Board of Directors",null,"At a corporate level the Board of Directors are local municipal government officials who are able to provide feedback received from constituents regarding distribution related concerns."]
[]
[]
[]
[]
[]
[]
[]
[]
["Note:  Use \"ALT-ENTER\" to go to the next line within a cell"]

{"sheet":"App.2-B_Acctg Instructions","index":8,"n_rows":54,"n_cols":7,"rows_kept":54,"cut":false,"hidden":false,"merged":[[107,0,107,10],[107,11,107,18],[108,0,108,10],[108,11,108,18],[109,0,109,10],[109,11,109,18],[104,0,104,10],[104,11,104,18],[105,0,105,10],[105,11,105,18],[106,0,106,10],[106,11,106,18],[101,0,101,10],[101,11,101,18],[102,0,102,10],[102,11,102,18],[103,0,103,10],[103,11,103,18],[98,0,98,10],[98,11,98,18],[99,0,99,10],[99,11,99,18],[100,0,100,10],[100,11,100,18],[95,0,95,10],[95,11,95,18],[96,0,96,10],[96,11,96,18],[97,0,97,10],[97,11,97,18],[92,0,92,10],[92,11,92,18],[93,0,93,10],[93,11,93,18],[94,0,94,10],[94,11,94,18],[89,0,89,10],[89,11,89,18],[90,0,90,10],[90,11,90,18],[91,0,91,10],[91,11,91,18],[86,0,86,10],[86,11,86,18],[87,0,87,10],[87,11,87,18],[88,0,88,10],[88,11,88,18],[83,0,83,10],[83,11,83,18],[84,0,84,10],[84,11,84,18],[85,0,85,10],[85,11,85,18],[80,0,80,10],[80,11,80,18],[81,0,81,10],[81,11,81,18],[82,0,82,10],[82,11,82,18],[76,11,76,18],[77,0,77,10],[77,11,77,18],[78,0,78,10],[78,11,78,18],[79,0,79,10],[79,11,79,18],[73,0,73,10],[73,11,73,18],[74,0,74,10],[74,11,74,18],[75,0,75,10],[75,11,75,18],[70,0,70,10],[70,11,70,18],[71,0,71,10],[71,11,71,18],[72,0,72,10],[72,11,72,18],[67,0,67,10],[67,11,67,18],[68,0,68,10],[68,11,68,18],[69,0,69,10],[69,11,69,18],[64,0,64,10],[64,11,64,18],[65,0,65,10],[65,11,65,18],[66,0,66,10],[66,11,66,18],[61,0,61,10],[61,11,61,18],[62,0,62,10],[62,11,62,18],[63,0,63,10],[63,11,63,18],[57,0,57,10],[57,11,57,18],[58,0,58,10],[58,11,58,18],[59,11,59,18],[60,0,60,10],[60,11,60,18],[42,1,42,12],[43,1,43,12],[46,1,46,11],[47,0,48,12],[53,0,53,12],[56,0,56,10],[56,11,56,18],[19,0,19,8],[20,0,20,8],[26,0,28,10],[30,0,30,9],[36,0,36,10],[37,0,37,11],[0,0,0,10],[1,0,1,10],[5,0,5,10],[8,4,8,5],[10,0,16,0],[18,0,18,9]]}
["General Instructions to MIFRS Appendices"]
["Types of Schedules to File"]
[]
["The purpose of this tab is to provide general instructions.  The specific instructions to each appendix are listed in footnotes of each appendix."]
[]
["The typical applicant is expected to have made capitalization and depreciation policy changes under CGAAP as permitted by the Board on January 1, 2012 or mandated by the Board by January 1, 2013, and adopted IFRS for reporting purposes on January 1, 2015 (transition date January 1, 2014).  Some distributors filing for 2018 rates have rebased with these accounting changes reflected in a prior rebasing application.  If that is the case, information relating to pre-accounting policy changes is not generally required.  The information to be provided by applicants will depend on when the accounting policy changes were made and when they last rebased.  In general, applicants should provide the following information in the appendices: "]
[]
[]
[null,null,null,null,"Reflecting Accounting Policy Changes in Current Application",null,"Reflected Accounting Policy Changes in Prior Application3"]
[null,null,null,null,"Accounting Policy Changes in 2012 and Adopted IFRS in 2015","Accounting Policy Changes in 2013 and Adopted IFRS in 2015","Adopted IFRS in 2015"]
["Information to be filed in 2018 CoS Application",2018,"Test",null,"MIFRS","MIFRS","MIFRS"]
[null,2017,"Bridge",null,"MIFRS","MIFRS","MIFRS"]
[null,2016,"Historical",null,"MIFRS","MIFRS","MIFRS"]
[null,2015,"Historical",null,"MIFRS","MIFRS","MIFRS"]
[null,2014,"Historical",null," MIFRS and Revised CGAAP1"," MIFRS and Revised CGAAP1"," MIFRS and Revised CGAAP1"]
[null,2013,"Historical",null,"Revised CGAAP","CGAAP and Revised CGAAP2","N/A"]
[null,2012,"Historical",null,"CGAAP and Revised CGAAP2","N/A","N/A"]
[]
["1)  For the transition year (2014), the applicant may file two appendices, one under Revised CGAAP and one under MIFRS, depending on the materiality of impacts.  See the specific instructions under each appendix below for further details."]
["2) For applicants that are reflecting accounting policy changes for the first time in a rebasing application, the applicant must file two appendices in the year that the applicant implemented changes to its capitalization and depreciation policies (2012 or 2013), one before and one after the policy changes."]
["3) Applicants should provide CGAAP and Revised CGAAP schedules (i.e. as indicated in the first two columns of the above table) to support balances in Account 1576 if the account has yet to be disposed of."]
[]
[]
["Appendix 2-BA - Fixed Asset Schedule "]
[]
["Applicants are to provide Appendix 2-BA in accordance with the years and corresponding accounting standards noted in the above table to provide a year over year continuity in fixed assets."]
["For the transition year (2014), the applicant should file two appendices, one under Revised CGAAP and one under MIFRS if the change between Revised CGAAP and MIFRS is material.  If the change from the accounting standards is not material, the applicant may choose to only provide one appendix under MIFRS.  However, the applicant must also indicate the fixed asset net book value balance under Revised CGAAP, the total dollar value of the change and explain why it is not material."]
[]
[]
[]
["The applicant must establish the continuity of historic cost for gross assets and accumulated depreciation by asset class by ensuring that the opening balance in the year agrees to the closing balance in the prior year."]
[]
[]
["Appendix 2-Cx - Depreciation and Amortization "]
[]
["Applicants are to provide Appendix 2-C in accordance with the years and corresponding accounting standards listed in the above table.  "]
["Appendix 2-C is to be used under all three of the scenarios presented in the table above. In the appendix, the applicant will need to indicate which scenario applies. The appendix is to be duplicated for each year and accounting standard required under the scenario."]
["Depreciation accounting policy changes were mandated by the Board by January 1, 2013. In general, no further changes to an applicant's depreciation policy (i.e.  assets' service lives) are expected after the Board mandated changes by January 1, 2013.    If the applicant has made any changes to its depreciation policy subsequent to the Board mandated changes, for the year of the change, applicants must complete Appendix 2-C before and after the change. Applicants must also  explain the nature of the change, the reason for the change, quantify the impact of the change, and quantify the depreciation expense before and after the change."]
[]
["Appendix 2-E - Account 1575, IFRS-CGAAP Transitional PP&E Amounts (2-EA), Account 1576, Accounting Changes Under CGAAP (2-EB, 2-EC)"]
[]
["1) For an applicant that has a balance in Account 1576 to dispose:"]
["·       ","If an applicant changed capitalization and depreciation policies effective January 1, 2012, the applicant must complete Appendix 2-EB "]
["·       ","If an applicant changed capitalization and depreciation policies effective January 1, 2013, the applicant must complete Appendix 2-EC"]
[]
["2) For an applicant that has a balance in Account 1575 to dispose:"]
["·       ","The applicant must complete 2-EA"]
[" If the applicant did not make any further PP&E accounting policy changes beyond the capitalization and depreciation policy changes as mandated by the Board by January 1, 2013 (i.e. no further changes made on transition to IFRS), the applicant must indicate this and does not need to complete Appendix 2-EA."]
[]
[]
[]
["Appendix 2-Y - Summary of Impacts to Revenue Requirement from Transition to MIFRS"]
[]
["An applicant must provide a summary of the dollar impacts of MIFRS to each component of the revenue requirement (e.g. rate base, operating costs, etc.), including the overall impact on the proposed revenue requirement.  Accordingly,  the applicant must identify financial differences and resulting revenue requirement impacts arising from the adoption of  MIFRS as compared to CGAAP.  If the applicant is reflecting the changes in capitalization and depreciation policies for the first time in a rebasing application, then a comparison between MIFRS and CGAAP before the change in accounting policies should be completed.  If the applicant changed capitalization and depreciation policies and  reflected these changes in a prior rebasing application, then a comparison between MIFRS and CGAAP after the change in accounting policies should be completed.  "]

{"sheet":"App.2-BA_Fixed Asset Cont","index":9,"n_rows":746,"n_cols":13,"rows_kept":746,"cut":false,"hidden":false,"merged":[[739,1,739,12],[745,1,747,12],[677,3,677,6],[723,2,723,8],[724,2,724,8],[733,1,734,12],[736,1,737,12],[646,1,647,12],[649,1,649,12],[655,1,657,12],[671,0,671,12],[672,0,672,12],[582,0,582,12],[587,3,587,6],[633,2,633,8],[634,2,634,8],[643,1,644,12],[553,1,554,12],[556,1,557,12],[559,1,559,12],[565,1,567,12],[581,0,581,12],[491,0,491,12],[492,0,492,12],[497,3,497,6],[543,2,543,8],[544,2,544,8],[456,2,456,8],[465,1,466,12],[468,1,469,12],[471,1,471,12],[477,1,479,12],[367,2,367,8],[368,2,368,8],[404,0,404,12],[409,3,409,6],[455,2,455,8],[403,0,403,12],[377,1,378,12],[380,1,381,12],[383,1,383,12],[389,1,391,12],[73,1,74,12],[76,1,76,12],[8,0,8,12],[9,0,9,12],[14,3,14,6],[60,2,60,8],[61,2,61,8],[70,1,71,12],[82,1,84,12],[98,0,98,12],[99,0,99,12],[104,3,104,6],[150,2,150,8],[151,2,151,8],[172,0,172,12],[173,0,173,12],[178,3,178,6],[224,2,224,8],[225,2,225,8],[244,0,244,12],[315,0,315,12],[316,0,316,12],[321,3,321,6],[245,0,245,12],[250,3,250,6],[296,2,296,8],[297,2,297,8]]}
[null,null,null,null,null,null,null,null,null,null,null,"File Number:",{"$f":"EBNUMBER","v":"EB-2017-0038"}]
[null,null,null,null,null,null,null,null,null,null,null,"Exhibit:",2]
[null,null,null,null,null,null,null,null,null,null,null,"Tab:",2]
[null,null,null,null,null,null,null,null,null,null,null,"Schedule:"]
[null,null,null,null,null,null,null,null,null,null,null,"Page:","2017-05-13"]
[]
[null,null,null,null,null,null,null,null,null,null,null,"Date:","Sept 12, 2017"]
[]
["Appendix 2-BA"]
["Fixed Asset Continuity Schedule 1 "]
[]
[null,null,null,null,"Accounting Standard","CGAAP"]
[null,null,null,null,"Year ",2012]
[]
[null,null,null,"Cost",null,null,null,null,null,"Accumulated Depreciation"]
["CCA Class 2","OEB Account 3","Description 3","Opening Balance","Additions 4","Disposals 6","Closing Balance",null,"Opening Balance","Additions","Disposals 6","Closing Balance","Net Book Value"]
[12,1611,"Computer Software (Formally known as Account 1925)",1045366.7999999999,40095.919999999998,null,{"$f":"SUM(D17:F17)","v":1085462.72},null,-561591.06999999995,-68496,null,{"$f":"I17+J17+K17","v":-630087.06999999995},{"$f":"G17+L17","v":455375.65}]
["CEC",1612,"Land Rights (Formally known as Account 1906)",37599.93,5332.11,null,{"$f":"D18+E18+F18","v":42932.04},null,null,null,null,{"$f":"I18+J18+K18","v":0},{"$f":"G18+L18","v":42932.04}]
["N/A",1805,"Land",103344.08,null,null,{"$f":"D19+E19+F19","v":103344.08},null,null,null,null,{"$f":"I19+J19+K19","v":0},{"$f":"G19+L19","v":103344.08}]
[47,1808,"Buildings",173326.53,22624.44,null,{"$f":"D20+E20+F20","v":195950.97},null,-63941.08,-7385.55,null,{"$f":"I20+J20+K20","v":-71326.63},{"$f":"G20+L20","v":124624.34}]
[13,1810,"Leasehold Improvements",null,null,null,0,null,null,null,null,0,0]
[47,1815,"Transformer Station Equipment >50 kV",null,null,null,0,null,null,null,null,0,0]
[47,1820,"Distribution Station Equipment <50 kV",503732.18,155956.53,-55000,604688.71,null,-219481.95,-23268,55000,-187749.95,416938.75999999995]
[47,1825,"Storage Battery Equipment",null,null,null,0,null,null,null,null,0,0]
[47,1830,"Poles, Towers & Fixtures",5481315.3599999994,570418.87,null,6051734.2299999995,null,-2197726.2000000002,-228717,null,-2426443.2000000002,3625291.0299999993]
[47,1835,"Overhead Conductors & Devices",10519284.689999999,795113.87,null,11314398.559999999,null,-6904826.6299999999,-435629,null,-7340455.6299999999,3973942.9299999988]
[47,1840,"Underground Conduit",2351312.04,335860.18,null,2687172.22,null,-188837.84,-100769.69,null,-289607.53000000003,2397564.6900000004]
[47,1845,"Underground Conductors & Devices",5236041.37,441641.59,null,5677682.96,null,-587363.93000000005,-218274.49,null,-805638.42,4872044.54]
[47,1850,"Line Transformers",6601893.8499999996,678175.89,null,7280069.7399999993,null,-948498.2,-277639.27,null,-1226137.47,6053932.2699999996]
[47,1855,"Services (Overhead & Underground)",3323673.9800000004,579769.31000000006,null,3903443.2900000005,null,-1274113.3699999999,-144542.34,null,-1418655.71,2484787.5800000005]
[47,1860,"Meters",2802097.97,143580.03,null,2945678,null,-355606.78,-114955.52,null,-470562.30000000005,2475115.7000000002]
[47,1860,"Meters (Smart Meters)",null,null,null,0,null,null,null,null,0,0]
["N/A",1905,"Land",null,null,null,0,null,null,null,null,0,0]
[47,1908,"Buildings & Fixtures",null,null,null,0,null,null,null,null,0,0]
[13,1910,"Leasehold Improvements",161500.94,25956.1,null,187457.04,null,-8963.7099999999991,-4234.45,null,-13198.16,174258.88]
[8,1915,"Office Furniture & Equipment (10 years)",75387.240000000005,10976.33,null,86363.57,null,-58478.31,-4719.92,null,-63198.229999999996,23165.340000000011]
[8,1915,"Office Furniture & Equipment (5 years)",null,null,null,0,null,null,null,null,0,0]
[10,1920,"Computer Equipment - Hardware",97941,null,null,97941,null,-97941,null,null,-97941,0]
[45,1920,"Computer Equip.-Hardware(Post Mar. 22/04)",3892,null,null,3892,null,-3892,null,null,-3892,0]
[45.1,1920,"Computer Equip.-Hardware(Post Mar. 19/07)",null,45925,null,45925,null,null,-4593,null,-4593,41332]
[10,1930,"Transportation Equipment",2733120.6300000004,104692.44999999998,-165985.35999999999,2671827.7200000007,null,-1633869.5199999998,-277988,165985,-1745872.5199999998,925955.20000000088]
[8,1935,"Stores Equipment",null,null,null,0,null,null,null,null,0,0]
[8,1940,"Tools, Shop & Garage Equipment",159237.59,16560,null,175797.59,null,-80871,-14987,null,-95858,79939.59]
[8,1945,"Measurement & Testing Equipment",14462.12,null,null,14462.12,null,-2035,-1426,null,-3461,11001.12]
[8,1950,"Power Operated Equipment",64090.6,null,null,64090.6,null,-5768,-6429,null,-12197,51893.599999999999]
[8,1955,"Communications Equipment",null,null,null,0,null,null,null,null,0,0]
[8,1955,"Communication Equipment (Smart Meters)",null,null,null,0,null,null,null,null,0,0]
[8,1960,"Miscellaneous Equipment ",null,null,null,0,null,null,null,null,0,0]
[47,1970,"Load Management Controls Customer Premises",null,null,null,0,null,null,null,null,0,0]
[47,1975,"Load Management Controls Utility Premises",null,null,null,0,null,null,null,null,0,0]
[47,1980,"System Supervisor Equipment",null,213964.79,null,213964.79,null,null,-10698,null,-10698,203266.79]
[47,1985,"Miscellaneous Fixed Assets",null,null,null,0,null,null,null,null,0,0]
[47,1990,"Other Tangible Property",null,null,null,0,null,null,null,null,0,0]
[47,1995,"Contributions & Grants",-4773539.49,-570598.79,null,-5344138.28,null,647119.04,217267.04,null,864386.08000000007,-4479752.2]
[47,2440,"Deferred Revenue5"]
[null,null,null,null,null,null,0,null,null,null,null,0,0]
[null,null,"Sub-Total",{"$f":"SUM(D17:D56)","v":36715081.410000004},{"$f":"SUM(E17:E56)","v":3616044.62},{"$f":"SUM(F17:F56)","v":-220985.36},{"$f":"SUM(G17:G56)","v":40110140.669999994},null,{"$f":"SUM(I17:I56)","v":-14546686.549999997},{"$f":"SUM(J17:J56)","v":-1727485.19},{"$f":"SUM(K17:K56)","v":220985},{"$f":"SUM(L17:L56)","v":-16053186.74},{"$f":"SUM(M17:M56)","v":24056953.93}]
[null,null,"Less Socialized Renewable Energy Generation Investments (input as negative)",null,null,null,{"$f":"D58+E58+F58","v":0},null,null,null,null,{"$f":"I58+J58+K58","v":0},{"$f":"G58+L58","v":0}]
[null,null,"Less Other Non Rate-Regulated Utility Assets (input as negative)",null,null,null,0,null,null,null,null,{"$f":"I59+J59+K59","v":0},0]
[null,null,"Total PP&E",{"$f":"SUM(D57:D59)","v":36715081.410000004},{"$f":"SUM(E57:E59)","v":3616044.62},{"$f":"SUM(F57:F59)","v":-220985.36},{"$f":"SUM(G57:G59)","v":40110140.669999994},null,{"$f":"SUM(I57:I59)","v":-14546686.549999997},{"$f":"SUM(J57:J59)","v":-1727485.19},{"$f":"SUM(K57:K59)","v":220985},{"$f":"SUM(L57:L59)","v":-16053186.74},{"$f":"SUM(M57:M59)","v":24056953.93}]
[null,null,"Depreciation Expense adj. from gain or loss on the retirement of assets (pool of like assets), if applicable6"]
[null,null,"Total",null,null,null,null,null,null,{"$f":"J60+J61","v":-1727485.19}]
[]
[null,null,null,null,null,null,null,null,"Less: Fully Allocated Depreciation"]
[10,null,"Transportation",null,null,null,null,null,"Transportation"]
[8,null,"Stores Equipment",null,null,null,null,null,"Stores Equipment"]
[null,null,null,null,null,null,null,null,"Net Depreciation",null,{"$f":"J62-K65-K66","v":-1727485.19}]
[]
["Notes:"]
[]
[1,"Tables in the format outlined above covering all fixed asset accounts should be submitted for the Test Year, Bridge Year and all relevant historical years.  At a minimum , the applicant must provide data for the earlier of: 1) all historical years back to its last rebasing; or 2) at least three years of historical actuals, in addition to Bridge Year and Test Year forecasts."]
[]
[]
[2,"The \"CCA Class\" for fixed assets should agree with the CCA Class used for tax purposes in Tax Returns. Fixed Assets sub-components may be used where the underlying asset components are classified under multiple CCA Classes for tax purposes. If an applicant uses any different classes from those shown in the table, an explanation should be provided. (also see note 3)."]
[]
[]
[3,"The table may need to be customized for a utility's asset categories or for any new asset accounts announced or authorized by the Board."]
[]
[4,"The additions in column (E) must not include construction work in progress (CWIP)."]
[]
[5,"Effective on the date of IFRS adoption, customer contributions will no longer be recorded in Account 1995 Contributions & Grants, but will be recorded in Account 2440, Deferred Revenues.  "]
[]
[6,"The applicant must ensure that all asset disposals have been clearly identified in the Chapter 2 Appendices for all historic, bridge and test years.  Where a distributor for general financial reporting purposes under IFRS has accounted for the amount of gain or loss on the retirement of assets in a pool of like assets as a charge or credit to income, for reporting and rate application filings, the distributor shall reclassify such gains and losses as depreciation expense, and disclose the amount separately."]
[]
[]
[]
[]
[]
[]
[]
[]
[]
[]
[]
[]
[]
[]
[]
["Appendix 2-BA"]
["Fixed Asset Continuity Schedule 1 "]
[]
[null,null,null,null,"Accounting Standard","CGAAP"]
[null,null,null,null,"Year ",2013]
[]
[null,null,null,"Cost",null,null,null,null,null,"Accumulated Depreciation"]
["CCA Class 2","OEB Account 3","Description 3","Opening Balance","Additions 4","Disposals 6","Closing Balance",null,"Opening Balance","Additions","Disposals 6","Closing Balance","Net Book Value"]
[12,1611,"Computer Software (Formally known as Account 1925)",{"$f":"G17","v":1085462.72},54670.75,0,{"$f":"SUM(D107:F107)","v":1140133.47},null,-630087.06999999995,-107453.90000000002,0,-737540.97,402592.5]
["CEC",1612,"Land Rights (Formally known as Account 1906)",{"$f":"G18","v":42932.04},947,0,43879.040000000001,null,0,0,0,0,43879.040000000001]
["N/A",1805,"Land",103344.08,695,0,104039.08,null,0,0,0,0,104039.08]
[47,1808,"Buildings",195950.97,24917.26,0,220868.23,null,-71326.63,-3747.429999999993,0,-75074.06,145794.17000000001]
[13,1810,"Leasehold Improvements",0,0,0,0,null,0,0,0,0,0]
[47,1815,"Transformer Station Equipment >50 kV",0,0,0,0,null,0,0,0,0,0]
[47,1820,"Distribution Station Equipment <50 kV",604688.71,16590.587095652314,0,621279.29709565232,null,-187749.95,-10484.459999999992,0,-198234.41,423044.88709565229]
[47,1825,"Storage Battery Equipment",0,0,0,0,null,0,0,0,0,0]
[47,1830,"Poles, Towers & Fixtures",6051734.2299999995,508874.06476657465,0,6560608.2947665742,null,-2426443.2000000002,-118541.81999999983,0,-2544985.02,4015623.2747665741]
[47,1835,"Overhead Conductors & Devices",11314398.559999999,770131.24864008767,0,12084529.808640087,null,-6840664.0300000003,-194411.70999999996,0,-7035075.7400000002,5049454.0686400868]
[47,1840,"Underground Conduit",2687172.22,46781.473294557421,0,2733953.6932945577,null,-289607.53000000003,-65746.189999999944,0,-355353.72,2378599.973294558]
[47,1845,"Underground Conductors & Devices",5677682.96,379359.97891090001,0,6057042.9389108997,null,-805638.42,-148259.65999999992,0,-953898.08,5103144.8589108996]
[47,1850,"Line Transformers",7280069.7399999993,649660.91936591454,-110118,7819612.6593659138,null,-1226137.47,-151650.67999999993,110118,-1267670.1499999999,6551942.5093659144]
[47,1855,"Services (Overhead & Underground)",3903443.2900000005,332065.1963997269,0,4235508.4863997269,null,-1418655.71,-67624.720000000118,0,-1486280.4300000002,2749228.0563997268]
[47,1860,"Meters",1632236,35278.005015968803,0,1667514.3650159691,null,-887755.97,-310677.15999999997,0,-1198433.1299999999,469081.23501596926]
[47,1860,"Meters (Smart Meters)",2887735,229651.07798532827,0,3117386.2479853281,null,0,0,0,0,3117386.2479853281]
["N/A",1905,"Land",0,0,0,0,null,0,0,0,0,0]
[47,1908,"Buildings & Fixtures",0,0,0,0,null,0,0,0,0,0]
[13,1910,"Leasehold Improvements",187457.04,53272.5,0,240729.54,null,-13198.16,-3892.5999999999985,0,-17090.759999999998,223638.78]
[8,1915,"Office Furniture & Equipment (10 years)",86363.57,3059.23,0,89422.8,null,-63198.229999999996,-5093.2200000000012,0,-68291.45,21131.350000000006]
[8,1915,"Office Furniture & Equipment (5 years)",0,0,0,0,null,0,0,0,0,0]
[10,1920,"Computer Equipment - Hardware",97941,0,0,97941,null,-97941,0,0,-97941,0]
[45,1920,"Computer Equip.-Hardware(Post Mar. 22/04)",3892,0,0,3892,null,-3892,0,0,-3892,0]
[45.1,1920,"Computer Equip.-Hardware(Post Mar. 19/07)",45925,57213.91,0,103138.91,null,-4593,-14850.16,0,-19443.16,83695.75]
[10,1930,"Transportation Equipment",2671827.7200000007,386631.99,-46600,3011859.7100000009,null,-1745872.3,-260859.20999999996,46600,-1960131.51,1051728.2000000009]
[8,1935,"Stores Equipment",0,0,0,0,null,0,0,0,0,0]
[8,1940,"Tools, Shop & Garage Equipment",175797.59,16441.830000000002,0,192239.41999999998,null,-95858,-21830.309999999998,0,-117688.31,74551.109999999986]
[8,1945,"Measurement & Testing Equipment",14462.12,0,0,14462.12,null,-3461,-1807.9799999999996,0,-5268.98,9193.1400000000012]
[8,1950,"Power Operated Equipment",64090.6,0,0,64090.6,null,-12197,-8011.7799999999988,0,-20208.78,43881.82]
[8,1955,"Communications Equipment",0,0,0,0,null,0,0,0,0,0]
[8,1955,"Communication Equipment (Smart Meters)",0,0,0,0,null,0,0,0,0,0]
[8,1960,"Miscellaneous Equipment ",0,0,0,0,null,0,0,0,0,0]
[47,1970,"Load Management Controls Customer Premises",0,0,0,0,null,0,0,0,0,0]
[47,1975,"Load Management Controls Utility Premises",0,0,0,0,null,0,0,0,0,0]
[47,1980,"System Supervisor Equipment",213964.79,42215.85,0,256180.64,null,-10698,-47014.75,0,-57712.75,198467.89]
[47,1985,"Miscellaneous Fixed Assets",0,0,0,0,null,0,0,0,0,0]
[47,1990,"Other Tangible Property",0,0,0,0,null,0,0,0,0,0]
[47,1995,"Contributions & Grants",-5344138.28,-1446296.2299999995,0,-6790434.5099999998,null,864386.08000000007,106624.45999999996,0,971010.54,-5819423.9699999997]
[47,2440,"Deferred Revenue5",null,null,null,null,null,0,0,0,0]
[null,null,null,null,null,null,0,null,0,0,0,0,0]
[null,null,"Sub-Total",{"$f":"SUM(D107:D146)","v":41684433.669999994},{"$f":"SUM(E107:E146)","v":2162161.6414747112},-156718,43689877.841474704,null,-15970588.590000002,-1435333.2799999998,156718,-17249203.870000001,26440673.971474718]
[null,null,"Less Socialized Renewable Energy Generation Investments (input as negative)",null,null,null,0,null,null,null,null,0,0]
[null,null,"Less Other Non Rate-Regulated Utility Assets (input as negative)",null,null,null,0,null,null,null,null,0,0]
[null,null,"Total PP&E",{"$f":"SUM(D147:D149)","v":41684433.669999994},{"$f":"SUM(E147:E149)","v":2162161.6414747112},-156718,43689877.841474704,null,-15970588.590000002,-1435333.2799999998,156718,-17249203.870000001,26440673.971474718]
[null,null,"Depreciation Expense adj. from gain or loss on the retirement of assets (pool of like assets), if applicable6"]
[null,null,"Total",null,null,null,null,null,null,-1435333.2799999998]
[null,null,null,{"$f":"D150-G60","v":1574293}]
[null,null,null,null,null,null,null,null,"Less: Fully Allocated Depreciation"]
[10,null,"Transportation",null,null,null,null,null,"Transportation"]
[8,null,"Stores Equipment",null,null,null,null,null,"Stores Equipment"]
[null,null,null,null,null,null,null,null,"Net Depreciation",null,-1435333.2799999998]
[]
[]
[]
[]
[]
[]
[]
[]
[]
[]
[]
[]
[]
[]
[]
["Appendix 2-BA"]
["Fixed Asset Continuity Schedule 1 "]
[]
[null,null,null,null,"Accounting Standard","CGAAP","Revised"]
[null,null,null,null,"Year ",2013]
[]
[null,null,null,"Cost",null,null,null,null,null,"Accumulated Depreciation"]
["CCA Class 2","OEB Account 3","Description 3","Opening Balance","Additions 4","Disposals 6","Closing Balance",null,"Opening Balance","Additions","Disposals 6","Closing Balance","Net Book Value"]
[12,1611,"Computer Software (Formally known as Account 1925)",1085462.72,54670.75,null,1140133.47,null,-630087.06999999995,-107453.90000000002,null,-737540.97,402592.5]
["CEC",1612,"Land Rights (Formally known as Account 1906)",42932.04,947,null,43879.040000000001,null,0,null,null,0,43879.040000000001]
["N/A",1805,"Land",103344.08,695,null,104039.08,null,0,null,null,0,104039.08]
[47,1808,"Buildings",195950.97,24917.26,null,220868.23,null,-71326.63,-3747.429999999993,null,-75074.06,145794.17000000001]
[13,1810,"Leasehold Improvements",0,null,null,0,null,0,null,null,0,0]
[47,1815,"Transformer Station Equipment >50 kV",0,null,null,0,null,0,null,null,0,0]
[47,1820,"Distribution Station Equipment <50 kV",604688.71,12875,null,617563.71,null,-187749.95,-10484.459999999992,null,-198234.41,419329.29999999993]
[47,1825,"Storage Battery Equipment",0,null,null,0,null,0,null,null,0,0]
[47,1830,"Poles, Towers & Fixtures",6051734.2299999995,471688.41,null,6523422.6399999997,null,-2426443.2000000002,-118541.81999999983,null,-2544985.02,3978437.6199999996]
[47,1835,"Overhead Conductors & Devices",11314398.559999999,700608.48,null,12015007.039999999,null,-6840664.0300000003,-194411.70999999996,null,-7035075.7400000002,4979931.2999999989]
[47,1840,"Underground Conduit",2687172.22,30269.8,null,2717442.02,null,-289607.53000000003,-65746.189999999944,null,-355353.72,2362088.2999999998]
[47,1845,"Underground Conductors & Devices",5677682.96,344472.73,null,6022155.6899999995,null,-805638.42,-148259.65999999992,null,-953898.08,5068257.6099999994]
[47,1850,"Line Transformers",7280069.7399999993,604927.6,-110118,7774879.3399999989,null,-1226137.47,-151650.67999999993,110118,-1267670.1499999999,6507209.1899999995]
[47,1855,"Services (Overhead & Underground)",3903443.2900000005,308079.99,null,4211523.28,null,-1418655.71,-67624.720000000118,null,-1486280.4300000002,2725242.85]
[47,1860,"Meters",1632236.3600000003,25248.52,null,1657484.8800000004,null,-887755.97,-310677.15999999997,null,-1198433.1299999999,459051.75000000047]
[47,1860,"Meters (Smart Meters)",2887735.17,211907.02000000002,null,3099642.19,null,0,null,null,0,3099642.19]
["N/A",1905,"Land",0,null,null,0,null,0,null,null,0,0]
[47,1908,"Buildings & Fixtures",0,null,null,0,null,0,null,null,0,0]
[13,1910,"Leasehold Improvements",187457.04,53272.5,null,240729.54,null,-13198.16,-3892.5999999999985,null,-17090.759999999998,223638.78]
[8,1915,"Office Furniture & Equipment (10 years)",86363.57,3059.23,null,89422.8,null,-63198.229999999996,-5093.2200000000012,null,-68291.45,21131.350000000006]
[8,1915,"Office Furniture & Equipment (5 years)",0,null,null,0,null,0,null,null,0,0]
[10,1920,"Computer Equipment - Hardware",97941,null,null,97941,null,-97941,null,null,-97941,0]
[45,1920,"Computer Equip.-Hardware(Post Mar. 22/04)",3892,null,null,3892,null,-3892,null,null,-3892,0]
[45.1,1920,"Computer Equip.-Hardware(Post Mar. 19/07)",45925,57213.91,null,103138.91,null,-4593,-14850.16,null,-19443.16,83695.75]
[10,1930,"Transportation Equipment",2671827.7200000007,386631.99,-46600,3011859.7100000009,null,-1745872.3,-260859.20999999996,46600,-1960131.51,1051728.2000000009]
[8,1935,"Stores Equipment",0,null,null,0,null,0,null,null,0,0]
[8,1940,"Tools, Shop & Garage Equipment",175797.59,16441.830000000002,null,192239.41999999998,null,-95858,-21830.309999999998,null,-117688.31,74551.109999999986]
[8,1945,"Measurement & Testing Equipment",14462.12,null,null,14462.12,null,-3461,-1807.9799999999996,null,-5268.98,9193.1400000000012]
[8,1950,"Power Operated Equipment",64090.6,null,null,64090.6,null,-12197,-8011.7799999999988,null,-20208.78,43881.82]
[8,1955,"Communications Equipment",0,null,null,0,null,0,null,null,0,0]
[8,1955,"Communication Equipment (Smart Meters)",0,null,null,0,null,0,null,null,0,0]
[8,1960,"Miscellaneous Equipment ",0,null,null,0,null,0,null,null,0,0]
[47,1970,"Load Management Controls Customer Premises",0,null,null,0,null,0,null,null,0,0]
[47,1975,"Load Management Controls Utility Premises",0,null,null,0,null,0,null,null,0,0]
[47,1980,"System Supervisor Equipment",213964.79,42215.85,null,256180.64,null,-10698,-47014.75,null,-57712.75,198467.89]
[47,1985,"Miscellaneous Fixed Assets",0,null,null,0,null,0,null,null,0,0]
[47,1990,"Other Tangible Property",0,null,null,0,null,0,null,null,0,0]
[47,1995,"Contributions & Grants",-5344138.28,-1446296.2299999995,null,-6790434.5099999998,null,864386.08000000007,106624.45999999996,null,971010.54,-5819423.9699999997]
[47,2440,"Deferred Revenue5",0,null,null,null,null,0]
[null,null,null,0,null,null,0,null,0,null,null,0,0]
[null,null,"Sub-Total",41684434.199999996,1903846.6400000001,-156718,43431562.839999996,null,-15970588.590000002,-1435333.2799999998,156718,-17249203.870000001,26182358.970000006]
[null,null,"Less Socialized Renewable Energy Generation Investments (input as negative)",null,null,null,0,null,null,null,null,0,0]
[null,null,"Less Other Non Rate-Regulated Utility Assets (input as negative)",null,null,null,0,null,null,null,null,0,0]
[null,null,"Total PP&E",41684434.199999996,1903846.6400000001,-156718,43431562.839999996,null,-15970588.590000002,-1435333.2799999998,156718,-17249203.870000001,26182358.970000006]
[null,null,"Depreciation Expense adj. from gain or loss on the retirement of assets (pool of like assets), if applicable6"]
[null,null,"Total",null,null,null,null,null,null,-1435333.2799999998]
[]
[null,null,null,null,null,null,null,null,"Less: Fully Allocated Depreciation"]
[10,null,"Transportation",null,null,null,null,null,"Transportation"]
[8,null,"Stores Equipment",null,null,null,null,null,"Stores Equipment"]
[null,null,null,null,null,null,null,null,"Net Depreciation",null,-1435333.2799999998]
[]
[]
[]
[]
[]
[]
[]
[]
[]
[]
[]
[]
[]
["Appendix 2-BA"]
["Fixed Asset Continuity Schedule 1 "]
[]
[null,null,null,null,"Accounting Standard","CGAAP","Revised"]
[null,null,null,null,"Year ",2014]
[]
[null,null,null,"Cost",null,null,null,null,null,"Accumulated Depreciation"]
["CCA Class 2","OEB Account 3","Description 3","Opening Balance","Additions 4","Disposals 6","Closing Balance",null,"Opening Balance","Additions","Disposals 6","Closing Balance","Net Book Value"]
[12,1611,"Computer Software (Formally known as Account 1925)",1140133.47,87557.439999999944,0,1227690.9099999999,null,-737540.97,-79742.34,null,-817283.30999999994,410407.6]
["CEC",1612,"Land Rights (Formally known as Account 1906)",43879.040000000001,0,0,43879.040000000001,null,0,null,null,0,43879.040000000001]
["N/A",1805,"Land",104039.08,0,0,104039.08,null,0,null,null,0,104039.08]
[47,1808,"Buildings",220868.23,4014,0,224882.23,null,-75074.06,-8915.01,null,-83989.069999999992,140893.16000000003]
[13,1810,"Leasehold Improvements",0,0,0,0,null,0,null,null,0,0]
[47,1815,"Transformer Station Equipment >50 kV",0,0,0,0,null,0,null,null,0,0]
[47,1820,"Distribution Station Equipment <50 kV",617563.71,3664.9073003279773,0,621228.61730032798,null,-198234.41,-24702.55,null,-222936.95999999999,398291.65730032802]
[47,1825,"Storage Battery Equipment",0,0,0,0,null,0,null,null,0,0]
[47,1830,"Poles, Towers & Fixtures",6523422.6399999997,1270813.2524724056,-44396.47,7749839.4224724052,null,-2544985.02,-285578.90999999997,41615.86,-2788948.0700000003,4960891.3524724049]
[47,1835,"Overhead Conductors & Devices",12015007.039999999,1410234.9119059034,-1899.28,13423342.671905903,null,-7035075.7400000002,-507378.93,1899.28,-7540555.3899999997,5882787.2819059035]
[47,1840,"Underground Conduit",2717442.02,61798.831699930488,0,2779240.8516999306,null,-355353.72,-109611.13,null,-464964.85,2314276.0016999305]
[47,1845,"Underground Conductors & Devices",6022155.6899999995,734038.68367366423,-1121.82,6755072.5536736632,null,-953898.08,-254852.24,1121.82,-1207628.4999999998,5547444.0536736632]
[47,1850,"Line Transformers",7774879.3399999989,598730.32253643672,-69005.960000000006,8304603.7025364358,null,-1267670.1499999999,-322046.99,69005.960000000006,-1520711.18,6783892.5225364361]
[47,1855,"Services (Overhead & Underground)",4211523.28,548804.4075754697,0,4760327.6875754697,null,-1486280.4300000002,-178937.15000000002,null,-1665217.58,3095110.1075754697]
[47,1860,"Meters",null,0,0,0,null,null,null,null,0,0]
[47,1860,"Meters (Smart Meters)",4757127.07,162463.44158962549,-23019.75,4896570.7615896259,null,-1198433.1299999999,-318104.92,8152.83,-1508385.2199999997,3388185.5415896261]
["N/A",1905,"Land",0,0,0,0,null,0,null,null,0,0]
[47,1908,"Buildings & Fixtures",0,0,0,0,null,0,null,null,0,0]
[13,1910,"Leasehold Improvements",240729.54,47056.26999999999,0,287785.81,null,-17090.759999999998,-10570.31,null,-27661.07,260124.74]
[8,1915,"Office Furniture & Equipment (10 years)",89422.8,2395,0,91817.8,null,-68291.45,-4047.96,null,-72339.41,19478.39]
[8,1915,"Office Furniture & Equipment (5 years)",0,0,0,0,null,0,null,null,0,0]
[10,1920,"Computer Equipment - Hardware",97941,0,0,97941,null,-97941,null,null,-97941,0]
[45,1920,"Computer Equip.-Hardware(Post Mar. 22/04)",3892,0,0,3892,null,-3892,null,null,-3892,0]
[45.1,1920,"Computer Equip.-Hardware(Post Mar. 19/07)",103138.91,34018.25,0,137157.16,null,-19443.16,-24029.46,null,-43472.619999999995,93684.540000000008]
[10,1930,"Transportation Equipment",3011859.7100000009,137333.99999999991,-42442.85,3106750.8600000008,null,-1960131.51,-236641.62,28305.8,-2168467.33,938283.53000000073]
[8,1935,"Stores Equipment",0,0,0,0,null,0,null,null,0,0]
[8,1940,"Tools, Shop & Garage Equipment",192239.41999999998,23803.409999999974,0,216042.82999999996,null,-117688.31,-19475.21,null,-137163.51999999999,78879.309999999969]
[8,1945,"Measurement & Testing Equipment",14462.12,0,0,14462.12,null,-5268.98,-1446.21,null,-6715.19,7746.9300000000012]
[8,1950,"Power Operated Equipment",64090.6,0,0,64090.6,null,-20208.78,-6409.06,null,-26617.84,37472.759999999995]
[8,1955,"Communications Equipment",0,0,0,0,null,0,null,null,0,0]
[8,1955,"Communication Equipment (Smart Meters)",0,0,0,0,null,0,null,null,0,0]
[8,1960,"Miscellaneous Equipment ",0,0,0,0,null,0,null,null,0,0]
[47,1970,"Load Management Controls Customer Premises",0,0,0,0,null,0,null,null,0,0]
[47,1975,"Load Management Controls Utility Premises",0,0,0,0,null,0,null,null,0,0]
[47,1980,"System Supervisor Equipment",256180.64,3856.3099999999977,0,260036.95,null,-57712.75,-25618.06,null,-83330.81,176706.14]
[47,1985,"Miscellaneous Fixed Assets",0,0,0,0,null,0,null,null,0,0]
[47,1990,"Other Tangible Property",0,0,0,0,null,0,null,null,0,0]
[47,1995,"Contributions & Grants",-6790434.5099999998,0,0,-6790434.5099999998,null,971010.54,287836.3,null,1258846.8400000001,-5531587.6699999999]
[47,2440,"Deferred Revenue5",0,-810945.87000000011,null,-810945.87000000011,null,0]
[null,null,null,null,null,null,0,null,null,null,null,0,0]
[null,null,"Sub-Total",43431562.839999996,4319637.5687537631,-181886.13,47569314.278753757,null,-17249203.870000001,-2130271.7600000002,150101.55000000002,-19229374.080000002,29150886.068753757]
[null,null,"Less Socialized Renewable Energy Generation Investments (input as negative)",null,null,null,0,null,null,null,null,0,0]
[null,null,"Less Other Non Rate-Regulated Utility Assets (input as negative)",null,null,null,0,null,null,null,null,0,0]
[null,null,"Total PP&E",43431562.839999996,4319637.5687537631,-181886.13,47569314.278753757,null,-17249203.870000001,-2130271.7600000002,150101.55000000002,-19229374.080000002,29150886.068753757]
[null,null,"Depreciation Expense adj. from gain or loss on the retirement of assets (pool of like assets), if applicable6"]
[null,null,"Total",null,null,null,null,null,null,-2130271.7600000002]
[]
[null,null,null,null,null,null,null,null,"Less: Fully Allocated Depreciation"]
[10,null,"Transportation",null,null,null,null,null,"Transportation"]
[8,null,"Stores Equipment",null,null,null,null,null,"Stores Equipment"]
[null,null,null,null,null,null,null,null,"Net Depreciation",null,-2130271.7600000002]
[]
[]
[]
[]
[]
[]
[]
[]
[]
[]
[]
[]
["Appendix 2-BA"]
["Fixed Asset Continuity Schedule 1 "]
[]
[null,null,null,null,"Accounting Standard","MIFRS"]
[null,null,null,null,"Year ",2014]
[]
[null,null,null,"Cost",null,null,null,null,null,"Accumulated Depreciation"]
["CCA Class 2","OEB Account 3","Description 3","Opening Balance","Additions 4","Disposals 6","Closing Balance",null,"Opening Balance","Additions","Disposals 6","Closing Balance","Net Book Value"]
[12,1611,"Computer Software (Formally known as Account 1925)",1140133.47,87557.439999999944,null,1227690.9099999999,null,-737540.97,-159240.51,null,-896781.48,330909.42999999993]
["CEC",1612,"Land Rights (Formally known as Account 1906)",43879.040000000001,null,null,43879.040000000001,null,0,null,null,0,43879.040000000001]
["N/A",1805,"Land",104039.08,null,null,104039.08,null,0,null,null,0,104039.08]
[47,1808,"Buildings",220868.23,4014,null,224882.23,null,-75074.06,-3988.52,null,-79062.58,145819.65000000002]
[13,1810,"Leasehold Improvements",0,null,null,0,null,0,null,null,0,0]
[47,1815,"Transformer Station Equipment >50 kV",0,null,null,0,null,0,null,null,0,0]
[47,1820,"Distribution Station Equipment <50 kV",617563.71,null,null,617563.71,null,-198234.41,-10591.34,null,-208825.75,408737.95999999996]
[47,1825,"Storage Battery Equipment",0,null,null,0,null,0,null,null,0,0]
[47,1830,"Poles, Towers & Fixtures",6523422.6399999997,1232100.26,-44396.47,7711126.4299999997,null,-2544985.02,-142789.46,41615.870000000003,-2646158.61,5064967.82]
[47,1835,"Overhead Conductors & Devices",12015007.039999999,1338932.3300000008,-1899.28,13352040.09,null,-7035075.7400000002,-211407.89,1899.28,-7244584.3499999996,6107455.7400000002]
[47,1840,"Underground Conduit",2717442.02,45672.279999999795,null,2763114.3,null,-355353.72,-66590,null,-421943.72,2341170.58]
[47,1845,"Underground Conductors & Devices",6022155.6899999995,698300.43999999913,-1121.82,6719334.3099999987,null,-953898.08,-159846.03,1121.82,-1112622.2899999998,5606712.0199999986]
[47,1850,"Line Transformers",7774879.3399999989,552590.61000000034,-69005.960000000006,8258463.9899999993,null,-1267670.1499999999,-161023.49,69005.960000000006,-1359687.6799999999,6898776.3099999996]
[47,1855,"Services (Overhead & Underground)",4211523.28,523811.29000000004,null,4735334.57,null,-1486280.4300000002,-74557.149999999994,null,-1560837.58,3174496.99]
[47,1860,"Meters",1657484.8800000004,null,null,1657484.8800000004,null,-1198433.1299999999,null,null,-1198433.1299999999,459051.75000000047]
[47,1860,"Meters (Smart Meters)",3099642.19,134232.45999999996,-23019.75,3210854.9,null,0,-318104.92,8152.83,-309952.08999999997,2900902.81]
["N/A",1905,"Land",0,null,null,0,null,0,null,null,0,0]
[47,1908,"Buildings & Fixtures",0,null,null,0,null,0,null,null,0,0]
[13,1910,"Leasehold Improvements",240729.54,47056.26999999999,null,287785.81,null,-17090.759999999998,-4804.6899999999996,null,-21895.449999999997,265890.36]
[8,1915,"Office Furniture & Equipment (10 years)",89422.8,2395,null,91817.8,null,-68291.45,-2424.0700000000002,null,-70715.520000000004,21102.28]
[8,1915,"Office Furniture & Equipment (5 years)",0,null,null,0,null,0,null,null,0,0]
[10,1920,"Computer Equipment - Hardware",97941,null,null,97941,null,-97941,null,null,-97941,0]
[45,1920,"Computer Equip.-Hardware(Post Mar. 22/04)",3892,null,null,3892,null,-3892,null,null,-3892,0]
[45.1,1920,"Computer Equip.-Hardware(Post Mar. 19/07)",103138.91,34018.25,null,137157.16,null,-19443.16,-24029.46,null,-43472.619999999995,93684.540000000008]
[10,1930,"Transportation Equipment",3011859.7100000009,137333.99999999991,-42442.85,3106750.8600000008,null,-1960131.51,-216635.15999999997,28305.8,-2148460.87,958289.99000000069]
[8,1935,"Stores Equipment",0,null,null,0,null,0,null,null,0,0]
[8,1940,"Tools, Shop & Garage Equipment",192239.41999999998,23803.409999999974,null,216042.82999999996,null,-117688.31,-21335.55,null,-139023.85999999999,77018.969999999972]
[8,1945,"Measurement & Testing Equipment",14462.12,null,null,14462.12,null,-5268.98,-1807.77,null,-7076.75,7385.3700000000008]
[8,1950,"Power Operated Equipment",64090.6,null,null,64090.6,null,-20208.78,-8011.33,null,-28220.11,35870.49]
[8,1955,"Communications Equipment",0,null,null,0,null,0,null,null,0,0]
[8,1955,"Communication Equipment (Smart Meters)",0,null,null,0,null,0,null,null,0,0]
[8,1960,"Miscellaneous Equipment ",0,null,null,0,null,0,null,null,0,0]
[47,1970,"Load Management Controls Customer Premises",0,null,null,0,null,0,null,null,0,0]
[47,1975,"Load Management Controls Utility Premises",0,null,null,0,null,0,null,null,0,0]
[47,1980,"System Supervisor Equipment",256180.64,3856.3099999999977,null,260036.95,null,-57712.75,null,null,-57712.75,202324.2]
[47,1985,"Miscellaneous Fixed Assets",0,null,null,0,null,0,null,null,0,0]
[47,1990,"Other Tangible Property",0,null,null,0,null,0,null,null,0,0]
[47,1995,"Contributions & Grants",-6790434.5099999998,null,null,-6790434.5099999998,null,971010.54,null,null,971010.54,-5819423.9699999997]
[47,2440,"Deferred Revenue5",null,-810945.87000000011,null,-810945.87000000011,null,null,119931.79,null,119931.79,-691014.08000000007]
[null,null,null,null,null,null,0,null,null,null,null,0,0]
[null,null,"Sub-Total",43431562.839999996,4054728.4799999995,-181886.13,47304405.189999998,null,-17249203.870000001,-1467255.55,150101.56,-18566357.859999999,28738047.330000006]
[null,null,"Less Socialized Renewable Energy Generation Investments (input as negative)",null,null,null,0,null,null,null,null,0,0]
[null,null,"Less Other Non Rate-Regulated Utility Assets (input as negative)",null,null,null,0,null,null,null,null,0,0]
[null,null,"Total PP&E",43431562.839999996,4054728.4799999995,-181886.13,47304405.189999998,null,-17249203.870000001,-1467255.55,150101.56,-18566357.859999999,28738047.330000006]
[null,null,"Depreciation Expense adj. from gain or loss on the retirement of assets (pool of like assets), if applicable6",null,null,null,null,null,null,-5872.19]
[null,null,"Total",null,null,null,null,null,null,-1473127.74]
[]
[null,null,null,null,null,null,null,null,"Less: Fully Allocated Depreciation"]
[10,null,"Transportation",null,null,null,null,null,"Transportation"]
[8,null,"Stores Equipment",null,null,null,null,null,"Stores Equipment"]
[null,null,null,null,null,null,null,null,"Net Depreciation",null,-1473127.74]
[]
["Notes:"]
[]
[1,"Tables in the format outlined above covering all fixed asset accounts should be submitted for the Test Year, Bridge Year and all relevant historical years.  At a minimum , the applicant must provide data for the earlier of: 1) all historical years back to its last rebasing; or 2) at least three years of historical actuals, in addition to Bridge Year and Test Year forecasts."]
[]
[]
[2,"The \"CCA Class\" for fixed assets should agree with the CCA Class used for tax purposes in Tax Returns. Fixed Assets sub-components may be used where the underlying asset components are classified under multiple CCA Classes for tax purposes. If an applicant uses any different classes from those shown in the table, an explanation should be provided. (also see note 3)."]
[]
[]
[3,"The table may need to be customized for a utility's asset categories or for any new asset accounts announced or authorized by the Board."]
[]
[4,"The additions in column (E) must not include construction work in progress (CWIP)."]
[]
[5,"Effective on the date of IFRS adoption, customer contributions will no longer be recorded in Account 1995 Contributions & Grants, but will be recorded in Account 2440, Deferred Revenues.  "]
[]
[6,"The applicant must ensure that all asset disposals have been clearly identified in the Chapter 2 Appendices for all historic, bridge and test years.  Where a distributor for general financial reporting purposes under IFRS has accounted for the amount of gain or loss on the retirement of assets in a pool of like assets as a charge or credit to income, for reporting and rate application filings, the distributor shall reclassify such gains and losses as depreciation expense, and disclose the amount separately."]
[]
[]
[]
[]
[]
[]
[]
[]
[]
[]
[]
[]
[]
["Appendix 2-BA"]
["Fixed Asset Continuity Schedule 1 "]
[]
[null,null,null,null,"Accounting Standard","MIFRS"]
[null,null,null,null,"Year ",2015]
[]
[null,null,null,"Cost",null,null,null,null,null,"Accumulated Depreciation"]
["CCA Class 2","OEB Account 3","Description 3","Opening Balance","Additions 4","Disposals 6","Closing Balance",null,"Opening Balance","Additions","Disposals 6","Closing Balance","Net Book Value"]
[12,1611,"Computer Software (Formally known as Account 1925)",1227690.9099999999,218360.80000000005,null,1446051.71,null,-896781.48,-123586.65,null,-1020368.13,425683.57999999996]
["CEC",1612,"Land Rights (Formally known as Account 1906)",43879.040000000001,0,null,43879.040000000001,null,0,null,null,0,43879.040000000001]
["N/A",1805,"Land",104039.08,0,null,104039.08,null,0,null,null,0,104039.08]
[47,1808,"Buildings",224882.23,28387.339999999997,null,253269.57,null,-79062.58,-4258.53,null,-83321.11,169948.46000000002]
[13,1810,"Leasehold Improvements",0,null,null,0,null,0,null,null,0,0]
[47,1815,"Transformer Station Equipment >50 kV",0,null,null,0,null,0,null,null,0,0]
[47,1820,"Distribution Station Equipment <50 kV",617563.71,7.2759576141834259E-11,-51366.3,566197.41,null,-208825.75,-9727.65,16727.57,-201825.83,364371.58000000007]
[47,1825,"Storage Battery Equipment",0,null,null,0,null,0,null,null,0,0]
[47,1830,"Poles, Towers & Fixtures",7711126.4299999997,706809.00000000035,-28189.85,8389745.5800000001,null,-2646158.61,-160726.82,62828.58,-2744056.8499999996,5645688.7300000004]
[47,1835,"Overhead Conductors & Devices",13352040.09,983489.00000000058,-9685.11,14325843.98,null,-7244584.3499999996,-230568.31999999998,9685.11,-7465467.5599999996,6860376.4200000009]
[47,1840,"Underground Conduit",2763114.3,113924.05000000028,null,2877038.35,null,-421943.72,-68363.290000000008,null,-490307.01,2386731.34]
[47,1845,"Underground Conductors & Devices",6719334.3099999987,298197.3900000006,null,7017531.6999999993,null,-1112622.2899999998,-170886.16999999998,null,-1283508.4599999997,5734023.2399999993]
[47,1850,"Line Transformers",8258463.9899999993,725235.29999999888,-85500,8898199.2899999991,null,-1359687.6799999999,-213389.54,85500,-1487577.22,7410622.0699999994]
[47,1855,"Services (Overhead & Underground)",4735334.57,605659.81000000052,null,5340994.3800000008,null,-1560837.58,-83969.7,null,-1644807.28,3696187.1000000006]
[47,1860,"Meters",null,null,null,0,null,null,null,null,0,0]
[47,1860,"Meters (Smart Meters)",4868339.78,353471.40999999922,-88635,5133176.1899999995,null,-1508385.2199999997,-321764.63,46222.5,-1783927.3499999996,3349248.84]
["N/A",1905,"Land",0,null,null,0,null,0,null,null,0,0]
[47,1908,"Buildings & Fixtures",0,null,null,0,null,0,null,null,0,0]
[13,1910,"Leasehold Improvements",287785.81,127047.06,null,414832.87,null,-21895.449999999997,-6387.4400000000005,null,-28282.89,386549.98]
[8,1915,"Office Furniture & Equipment (10 years)",91817.8,5891.6499999999942,null,97709.45,null,-70715.520000000004,-4139.1000000000004,null,-74854.62000000001,22854.829999999987]
[8,1915,"Office Furniture & Equipment (5 years)",0,null,null,0,null,0,null,null,0,0]
[10,1920,"Computer Equipment - Hardware",97941,null,null,97941,null,-97941,null,null,-97941,0]
[45,1920,"Computer Equip.-Hardware(Post Mar. 22/04)",3892,null,null,3892,null,-3892,null,null,-3892,0]
[45.1,1920,"Computer Equip.-Hardware(Post Mar. 19/07)",137157.16,11372.01999999999,null,148529.18,null,-43472.619999999995,-28568.49,null,-72041.11,76488.069999999992]
[10,1930,"Transportation Equipment",3106750.8600000008,212572.78000000017,-125326.6,3193997.040000001,null,-2148460.87,-155910.31,125326.6,-2179044.58,1014952.4600000009]
[8,1935,"Stores Equipment",0,null,null,0,null,0,null,null,0,0]
[8,1940,"Tools, Shop & Garage Equipment",216042.82999999996,12250.850000000006,null,228293.67999999996,null,-139023.85999999999,-16109.48,null,-155133.34,73160.339999999967]
[8,1945,"Measurement & Testing Equipment",14462.12,16620,null,31082.120000000003,null,-7076.75,-2846.52,null,-9923.27,21158.850000000002]
[8,1950,"Power Operated Equipment",64090.6,158994.97,null,223085.57,null,-28220.11,1959.47,null,-26260.639999999999,196824.93]
[8,1955,"Communications Equipment",0,null,null,0,null,0,null,null,0,0]
[8,1955,"Communication Equipment (Smart Meters)",0,null,null,0,null,0,null,null,0,0]
[8,1960,"Miscellaneous Equipment ",0,null,null,0,null,0,null,null,0,0]
[47,1970,"Load Management Controls Customer Premises",0,null,null,0,null,0,null,null,0,0]
[47,1975,"Load Management Controls Utility Premises",0,null,null,0,null,0,null,null,0,0]
[47,1980,"System Supervisor Equipment",260036.95,64232.049999999988,null,324269,null,-57712.75,-58430.6,null,-116143.35,208125.65]
[47,1985,"Miscellaneous Fixed Assets",0,null,null,0,null,0,null,null,0,0]
[47,1990,"Other Tangible Property",0,null,null,0,null,0,null,null,0,0]
[47,1995,"Contributions & Grants",-6790434.5099999998,null,null,-6790434.5099999998,null,971010.54,126689,null,1097699.54,-5692734.9699999997]
[47,2440,"Deferred Revenue5",-810945.87000000011,-667718.79999999981,null,-1478664.67,null,119931.79,5564.32,null,125496.10999999999,-1353168.56]
[null,null,null,0,null,null,0,null,null,null,null,0,0]
[null,null,"Sub-Total",47304405.189999998,3974796.6799999997,-388702.86,50890499.009999998,null,-18566357.859999999,-1525420.45,346290.36,-19745487.950000003,31145011.060000006]
[null,null,"Less Socialized Renewable Energy Generation Investments (input as negative)",null,null,null,0,null,null,null,null,0,0]
[null,null,"Less Other Non Rate-Regulated Utility Assets (input as negative)",null,null,null,0,null,null,null,null,0,0]
[null,null,"Total PP&E",47304405.189999998,3974796.6799999997,-388702.86,50890499.009999998,null,-18566357.859999999,-1525420.45,346290.36,-19745487.950000003,31145011.060000006]
[null,null,"Depreciation Expense adj. from gain or loss on the retirement of assets (pool of like assets), if applicable6",null,null,null,null,null,null,20829.010000000002]
[null,null,"Total",null,null,null,null,null,null,-1504591.44]
[]
[null,null,null,null,null,null,null,null,"Less: Fully Allocated Depreciation"]
[10,null,"Transportation",null,null,null,null,null,"Transportation"]
[8,null,"Stores Equipment",null,null,null,null,null,"Stores Equipment"]
[null,null,null,null,null,null,null,null,"Net Depreciation",null,-1504591.44]
[]
["Notes:"]
[]
[1,"Tables in the format outlined above covering all fixed asset accounts should be submitted for the Test Year, Bridge Year and all relevant historical years.  At a minimum , the applicant must provide data for the earlier of: 1) all historical years back to its last rebasing; or 2) at least three years of historical actuals, in addition to Bridge Year and Test Year forecasts."]
[]
[]
[2,"The \"CCA Class\" for fixed assets should agree with the CCA Class used for tax purposes in Tax Returns. Fixed Assets sub-components may be used where the underlying asset components are classified under multiple CCA Classes for tax purposes. If an applicant uses any different classes from those shown in the table, an explanation should be provided. (also see note 3)."]
[]
[]
[3,"The table may need to be customized for a utility's asset categories or for any new asset accounts announced or authorized by the Board."]
[]
[4,"The additions in column (E) must not include construction work in progress (CWIP)."]
[]
[5,"Effective on the date of IFRS adoption, customer contributions will no longer be recorded in Account 1995 Contributions & Grants, but will be recorded in Account 2440, Deferred Revenues.  "]
[]
[6,"The applicant must ensure that all asset disposals have been clearly identified in the Chapter 2 Appendices for all historic, bridge and test years.  Where a distributor for general financial reporting purposes under IFRS has accounted for the amount of gain or loss on the retirement of assets in a pool of like assets as a charge or credit to income, for reporting and rate application filings, the distributor shall reclassify such gains and losses as depreciation expense, and disclose the amount separately."]
[]
[]
[]
[]
[]
[]
[]
[]
[]
[]
[]
[]
[]
["Appendix 2-BA"]
["Fixed Asset Continuity Schedule 1 "]
[]
[null,null,null,null,"Accounting Standard","MIFRS"]
[null,null,null,null,"Year ",2016]
[]
[null,null,null,"Cost",null,null,null,null,null,"Accumulated Depreciation"]
["CCA Class 2","OEB Account 3","Description 3","Opening Balance","Additions 4","Disposals 6","Closing Balance",null,"Opening Balance","Additions","Disposals 6","Closing Balance","Net Book Value"]
[12,1611,"Computer Software (Formally known as Account 1925)",1446051.71,27000.43,null,1473052.14,null,-968746.17,-139054.19,null,-1107800.3600000001,365251.7799999998]
["CEC",1612,"Land Rights (Formally known as Account 1906)",43879.040000000001,1800,null,45679.040000000001,null,0,null,null,0,45679.040000000001]
["N/A",1805,"Land",104039.08,74505,null,178544.08000000002,null,0,null,null,0,178544.08000000002]
[47,1808,"Buildings",253269.57,3193.5,null,256463.07,null,-83321.11,-4521.7,null,-87842.81,168620.26]
[13,1810,"Leasehold Improvements",0,null,null,0,null,0,null,null,0,0]
[47,1815,"Transformer Station Equipment >50 kV",0,null,null,0,null,0,null,null,0,0]
[47,1820,"Distribution Station Equipment <50 kV",566197.41,null,null,566197.41,null,-201825.83,-9727.65,null,-211553.47999999998,354643.93000000005]
[47,1825,"Storage Battery Equipment",0,null,null,0,null,0,null,null,0,0]
[47,1830,"Poles, Towers & Fixtures",8389745.5800000001,548836.86,-77577.100000000006,8861005.3399999999,null,-2744056.8499999996,-173283.28,77577.100000000006,-2839763.0299999993,6021242.3100000005]
[47,1835,"Overhead Conductors & Devices",14325843.98,887130.6,-340364.18,14872610.4,null,-7465467.5599999996,-246156.83000000002,340364.18,-7371260.21,7501350.1900000004]
[47,1840,"Underground Conduit",2877038.35,221002.74,null,3098041.09,null,-490307.01,-72084.7,null,-562391.71,2535649.38]
[47,1845,"Underground Conductors & Devices",7017531.6999999993,659041.52,-256441.2,7420132.0199999986,null,-1283508.4599999997,-181522.16,256441.2,-1208589.4199999997,6211542.5999999987]
[47,1850,"Line Transformers",8898199.2899999991,535550.79,-187547.86,9246202.2199999988,null,-1487577.22,-229149.36000000002,187547.86,-1529178.7200000002,7717023.4999999981]
[47,1855,"Services (Overhead & Underground)",5340994.3800000008,591580.52,null,5932574.9000000004,null,-1644806.99,-93946.409999999989,null,-1738753.4,4193821.5000000005]
[47,1860,"Meters",0,null,null,0,null,0,null,null,0,0]
[47,1860,"Meters (Smart Meters)",5133176.1899999995,246045.7,null,5379221.8899999997,null,-1783927.3499999996,-341033.47000000003,null,-2124960.8199999998,3254261.07]
["N/A",1905,"Land",0,null,null,0,null,0,null,null,0,0]
[47,1908,"Buildings & Fixtures",0,null,null,0,null,0,null,null,0,0]
[13,1910,"Leasehold Improvements",414832.87,41813.15,null,456646.02,null,-28282.89,-7922.54,null,-36205.43,420440.59]
[8,1915,"Office Furniture & Equipment (10 years)",97709.45,null,null,97709.45,null,-74854.62000000001,-4110.5,null,-78965.12000000001,18744.329999999987]
[8,1915,"Office Furniture & Equipment (5 years)",0,null,null,0,null,0,null,null,0,0]
[10,1920,"Computer Equipment - Hardware",97941,null,null,97941,null,-97941,null,null,-97941,0]
[45,1920,"Computer Equip.-Hardware(Post Mar. 22/04)",3892,null,null,3892,null,-3892,null,null,-3892,0]
[45.1,1920,"Computer Equip.-Hardware(Post Mar. 19/07)",148529.18,22003.13,null,170532.31,null,-72041.11,-31906,null,-103947.11,66585.2]
[10,1930,"Transportation Equipment",3193997.040000001,346258.45,-487092.5,3053162.9900000012,null,-2135667.2400000002,-192983.56,487092.5,-1841558.3000000003,1211604.6900000009]
[8,1935,"Stores Equipment",0,null,null,0,null,0,null,null,0,0]
[8,1940,"Tools, Shop & Garage Equipment",228293.67999999996,15489.42,null,243783.09999999998,null,-155133.34,-16742.559999999998,null,-171875.9,71907.199999999983]
[8,1945,"Measurement & Testing Equipment",31082.120000000003,null,null,31082.120000000003,null,-9923.27,-3885.27,null,-13808.54,17273.580000000002]
[8,1950,"Power Operated Equipment",223085.57,1573.8,null,224659.37,null,-26260.639999999999,-27665.06,null,-53925.7,170733.66999999998]
[8,1955,"Communications Equipment",0,31915.4,null,31915.4,null,0,-3191.54,null,-3191.54,28723.86]
[8,1955,"Communication Equipment (Smart Meters)",0,null,null,0,null,0,null,null,0,0]
[8,1960,"Miscellaneous Equipment ",0,null,null,0,null,0,null,null,0,0]
[47,1970,"Load Management Controls Customer Premises",0,null,null,0,null,0,null,null,0,0]
[47,1975,"Load Management Controls Utility Premises",0,null,null,0,null,0,null,null,0,0]
[47,1980,"System Supervisor Equipment",324269,188030.44,null,512299.44,null,-116143.35,-83656.84,null,-199800.19,312499.25]
[47,1985,"Miscellaneous Fixed Assets",0,null,null,0,null,0,null,null,0,0]
[47,1990,"Other Tangible Property",0,null,null,0,null,0,null,null,0,0]
[47,1995,"Contributions & Grants",-6790434.5099999998,null,null,-6790434.5099999998,null,1197358.3600000001,113173.91000000002,null,1310532.27,-5479902.2400000002]
[47,2440,"Deferred Revenue5",-1478664.67,-1192750.71,null,-2671415.38,null,125496.10999999999,10843.188272727273,null,136339.29827272726,-2535076.0817272728]
[null,null,null,0,null,null,0,null,0,null,null,0,0]
[null,null,"Sub-Total",50890499.009999998,3250020.7400000012,-1349022.8399999999,52791496.909999996,null,-19550829.539999999,-1738526.5217272732,1349022.8399999999,-19940333.221727271,32851163.688272722]
[null,null,"Less Socialized Renewable Energy Generation Investments (input as negative)",null,null,null,null,null,null,null,null,0]
[null,null,"Less Other Non Rate-Regulated Utility Assets (input as negative)",null,null,null,0,null,null,null,null,0,0]
[null,null,"Total PP&E",50890499.009999998,3086091.4800000014,-1349022.8399999999,52627567.649999999,null,-19550829.539999999,-1738526.5217272732,1349022.8399999999,-19940333.221727271,32687234.42827272]
[null,null,"Depreciation Expense adj. from gain or loss on the retirement of assets (pool of like assets), if applicable6"]
[null,null,"Total",null,null,null,null,null,null,-1738526.5217272732]
[]
[null,null,null,null,null,null,null,null,"Less: Fully Allocated Depreciation"]
[10,null,"Transportation",null,null,null,null,null,"Transportation"]
[8,null,"Stores Equipment",null,null,null,null,null,"Stores Equipment"]
[null,null,null,null,null,null,null,null,"Net Depreciation",null,-1738526.5217272732]
[]
["Notes:"]
[null,null,null,null,null,null,null,null,-110247.72000000023]
[1,"Tables in the format outlined above covering all fixed asset accounts should be submitted for the Test Year, Bridge Year and all relevant historical years.  At a minimum , the applicant must provide data for the earlier of: 1) all historical years back to its last rebasing; or 2) at least three years of historical actuals, in addition to Bridge Year and Test Year forecasts."]
[]
[]
[2,"The \"CCA Class\" for fixed assets should agree with the CCA Class used for tax purposes in Tax Returns. Fixed Assets sub-components may be used where the underlying asset components are classified under multiple CCA Classes for tax purposes. If an applicant uses any different classes from those shown in the table, an explanation should be provided. (also see note 3)."]
[]
[]
[3,"The table may need to be customized for a utility's asset categories or for any new asset accounts announced or authorized by the Board."]
[]
[4,"The additions in column (E) must not include construction work in progress (CWIP)."]
[]
[5,"Effective on the date of IFRS adoption, customer contributions will no longer be recorded in Account 1995 Contributions & Grants, but will be recorded in Account 2440, Deferred Revenues.  "]
[]
[6,"The applicant must ensure that all asset disposals have been clearly identified in the Chapter 2 Appendices for all historic, bridge and test years.  Where a distributor for general financial reporting purposes under IFRS has accounted for the amount of gain or loss on the retirement of assets in a pool of like assets as a charge or credit to income, for reporting and rate application filings, the distributor shall reclassify such gains and losses as depreciation expense, and disclose the amount separately."]
[]
[]
[]
[]
[]
[]
[]
[]
[]
[]
[]
[]
[]
[]
[]
["Appendix 2-BA"]
["Fixed Asset Continuity Schedule 1 "]
[]
[null,null,null,null,"Accounting Standard","MIFRS"]
[null,null,null,null,"Year ",2017]
[]
[null,null,null,"Cost",null,null,null,null,null,"Accumulated Depreciation"]
["CCA Class 2","OEB Account 3","Description 3","Opening Balance","Additions 4","Disposals 6","Closing Balance",null,"Opening Balance","Additions","Disposals 6","Closing Balance","Net Book Value"]
[12,1611,"Computer Software (Formally known as Account 1925)",1473052.14,35000,null,1508052.14,null,-1107800.3600000001,-144887.52333333335,null,-1252687.8833333335,255364.25666666636]
["CEC",1612,"Land Rights (Formally known as Account 1906)",45679.040000000001,null,null,45679.040000000001,null,0,0,null,0,45679.040000000001]
["N/A",1805,"Land",178544.08000000002,null,null,178544.08000000002,null,0,0,null,0,178544.08000000002]
[47,1808,"Buildings",256463.07,748343,null,1004806.0700000001,null,-87842.81,-11324.818181818182,null,-99167.628181818174,905638.44181818189]
[13,1810,"Leasehold Improvements",0,null,null,0,null,0,0,null,0,0]
[47,1815,"Transformer Station Equipment >50 kV",0,null,null,0,null,0,0,null,0,0]
[47,1820,"Distribution Station Equipment <50 kV",566197.41,null,null,566197.41,null,-211553.47999999998,-9727.65,null,-221281.12999999998,344916.28]
[47,1825,"Storage Battery Equipment",0,null,null,0,null,0,0,null,0,0]
[47,1830,"Poles, Towers & Fixtures",8861005.3399999999,360362.57211924688,null,9221367.912119247,null,-2839763.0299999993,-176886.90572119248,null,-3016649.9357211916,6204717.9763980554]
[47,1835,"Overhead Conductors & Devices",14872610.4,604844.70240387658,null,15477455.102403877,null,-7371260.21,-251197.20252003233,null,-7622457.4125200324,7854997.6898838449]
[47,1840,"Underground Conduit",3098041.09,125992.25628313584,null,3224033.3462831355,null,-562391.71,-73484.613958701506,null,-635876.32395870145,2588157.022324434]
[47,1845,"Underground Conductors & Devices",7420132.0199999986,301764.61446434277,null,7721896.6344643412,null,-1208589.4199999997,-184875.10016071494,null,-1393464.5201607146,6328432.1143036261]
[47,1850,"Line Transformers",9246202.2199999988,376027.89824454504,null,9622230.1182445437,null,-1529178.7200000002,-233849.70872805684,null,-1763028.4287280571,7859201.6895164866]
[47,1855,"Services (Overhead & Underground)",5932574.9000000004,1087500,null,7020074.9000000004,null,-1738753.4,-103008.90999999999,null,-1841762.3099999998,5178312.5900000008]
[47,1860,"Meters",0,null,null,0,null,0,0,null,0,0]
[47,1860,"Meters (Smart Meters)",5379221.8899999997,248628,null,5627849.8899999997,null,-2124960.8199999998,-351392.97000000003,null,-2476353.79,3151496.0999999996]
["N/A",1905,"Land",0,null,null,0,null,0,0,null,0,0]
[47,1908,"Buildings & Fixtures",0,null,null,0,null,0,0,null,0,0]
[13,1910,"Leasehold Improvements",456646.02,49000,null,505646.02,null,-36205.43,-8367.994545454545,null,-44573.424545454545,461072.59545454546]
[8,1915,"Office Furniture & Equipment (10 years)",97709.45,null,null,97709.45,null,-78965.12000000001,-4110.5,null,-83075.62000000001,14633.829999999987]
[8,1915,"Office Furniture & Equipment (5 years)",0,null,null,0,null,0,0,null,0,0]
[10,1920,"Computer Equipment - Hardware",97941,null,null,97941,null,-97941,0,null,-97941,0]
[45,1920,"Computer Equip.-Hardware(Post Mar. 22/04)",3892,null,null,3892,null,-3892,0,null,-3892,0]
[45.1,1920,"Computer Equip.-Hardware(Post Mar. 19/07)",170532.31,44950,null,215482.31,null,-103947.11,-36401,null,-140348.10999999999,75134.200000000012]
[10,1930,"Transportation Equipment",3053162.9900000012,135000,null,3188162.9900000012,null,-1841558.3000000003,-201421.06,null,-2042979.3600000003,1145183.6300000008]
[8,1935,"Stores Equipment",0,null,null,0,null,0,0,null,0,0]
[8,1940,"Tools, Shop & Garage Equipment",243783.09999999998,35000,null,278783.09999999998,null,-171875.9,-18930.059999999998,null,-190805.96,87977.139999999985]
[8,1945,"Measurement & Testing Equipment",31082.120000000003,null,null,31082.120000000003,null,-13808.54,-3885.27,null,-17693.810000000001,13388.310000000001]
[8,1950,"Power Operated Equipment",224659.37,null,null,224659.37,null,-53925.7,-27665.06,null,-81590.759999999995,143068.60999999999]
[8,1955,"Communications Equipment",31915.4,null,null,31915.4,null,-3191.54,-3191.54,null,-6383.08,25532.32]
[8,1955,"Communication Equipment (Smart Meters)",0,null,null,0,null,0,0,null,0,0]
[8,1960,"Miscellaneous Equipment ",0,null,null,0,null,0,0,null,0,0]
[47,1970,"Load Management Controls Customer Premises",0,null,null,0,null,0,0,null,0,0]
[47,1975,"Load Management Controls Utility Premises",0,null,null,0,null,0,0,null,0,0]
[47,1980,"System Supervisor Equipment",512299.44,50000,null,562299.43999999994,null,-199800.19,-88656.84,null,-288457.03000000003,273842.40999999992]
[47,1985,"Miscellaneous Fixed Assets",0,null,null,0,null,0,0,null,0,0]
[47,1990,"Other Tangible Property",0,null,null,0,null,0,0,null,0,0]
[47,1995,"Contributions & Grants",-6790434.5099999998,null,null,-6790434.5099999998,null,1310532.27,113173.91000000002,null,1423706.18,-5366728.33]
[47,2440,"Deferred Revenue5",-2671415.38,-652500,null,-3323915.38,null,136339.29827272726,25672.733727272727,null,162012.03199999998,-3161903.3479999998]
[null,null,null,null,null,null,0,null,null,null,null,0,0]
[null,null,"Sub-Total",52791496.909999996,3549913.0435151476,0,56341409.953515142,null,-19940333.221727271,-1794418.0834220317,0,-21734751.305149302,34606658.648365855]
[null,null,"Less Socialized Renewable Energy Generation Investments (input as negative)",-163929.26,null,null,-163929.26,null,0,0,null,0,-163929.26]
[null,null,"Less Other Non Rate-Regulated Utility Assets (input as negative)",null,null,null,0,null,null,null,null,0,0]
[null,null,"Total PP&E",52627567.649999999,3549913.0435151476,0,56177480.693515144,null,-19940333.221727271,-1794418.0834220317,0,-21734751.305149302,34442729.388365857]
[null,null,"Depreciation Expense adj. from gain or loss on the retirement of assets (pool of like assets), if applicable6"]
[null,null,"Total",null,null,null,null,null,null,-1794418.0834220317]
[]
[null,null,null,null,null,null,null,null,"Less: Fully Allocated Depreciation"]
[10,null,"Transportation",null,null,null,null,null,"Transportation"]
[8,null,"Stores Equipment",null,null,null,null,null,"Stores Equipment"]
[null,null,null,null,null,null,null,null,"Net Depreciation",null,-1794418.0834220317]
[]
["Notes:"]
[]
[1,"Tables in the format outlined above covering all fixed asset accounts should be submitted for the Test Year, Bridge Year and all relevant historical years.  At a minimum , the applicant must provide data for the earlier of: 1) all historical years back to its last rebasing; or 2) at least three years of historical actuals, in addition to Bridge Year and Test Year forecasts."]
[]
[]
[2,"The \"CCA Class\" for fixed assets should agree with the CCA Class used for tax purposes in Tax Returns. Fixed Assets sub-components may be used where the underlying asset components are classified under multiple CCA Classes for tax purposes. If an applicant uses any different classes from those shown in the table, an explanation should be provided. (also see note 3)."]
[]
[]
[3,"The table may need to be customized for a utility's asset categories or for any new asset accounts announced or authorized by the Board."]
[]
[4,"The additions in column (E) must not include construction work in progress (CWIP)."]
[]
[5,"Effective on the date of IFRS adoption, customer contributions will no longer be recorded in Account 1995 Contributions & Grants, but will be recorded in Account 2440, Deferred Revenues.  "]
[]
[6,"The applicant must ensure that all asset disposals have been clearly identified in the Chapter 2 Appendices for all historic, bridge and test years.  Where a distributor for general financial reporting purposes under IFRS has accounted for the amount of gain or loss on the retirement of assets in a pool of like assets as a charge or credit to income, for reporting and rate application filings, the distributor shall reclassify such gains and losses as depreciation expense, and disclose the amount separately."]
[]
[]
[]
[]
[]
[]
[]
[]
[]
[]
[]
[]
[]
[]
[]
["Appendix 2-BA"]
["Fixed Asset Continuity Schedule 1 "]
[]
[null,null,null,null,"Accounting Standard","MIFRS"]
[null,null,null,null,"Year ",2018]
[]
[null,null,null,"Cost",null,null,null,null,null,"Accumulated Depreciation"]
["CCA Class 2","OEB Account 3","Description 3","Opening Balance","Additions 4","Disposals 6","Closing Balance",null,"Opening Balance","Additions","Disposals 6","Closing Balance","Net Book Value"]
[12,1611,"Computer Software (Formally known as Account 1925)",1508052.14,35000,null,1543052.14,null,-1252687.8833333335,-150720.85666666669,null,-1403408.7400000002,139643.39999999967]
["CEC",1612,"Land Rights (Formally known as Account 1906)",45679.040000000001,null,null,45679.040000000001,null,0,0,null,0,45679.040000000001]
["N/A",1805,"Land",178544.08000000002,null,null,178544.08000000002,null,0,0,null,0,178544.08000000002]
[47,1808,"Buildings",1004806.0700000001,8000,null,1012806.0700000001,null,-99167.628181818174,-11391.484848484848,null,-110559.11303030302,902246.95696969703]
[13,1810,"Leasehold Improvements",0,null,null,0,null,0,0,null,0,0]
[47,1815,"Transformer Station Equipment >50 kV",0,null,null,0,null,0,0,null,0,0]
[47,1820,"Distribution Station Equipment <50 kV",566197.41,null,null,566197.41,null,-221281.12999999998,-9727.65,null,-231008.77999999997,335188.63000000006]
[47,1825,"Storage Battery Equipment",0,null,null,0,null,0,0,null,0,0]
[47,1830,"Poles, Towers & Fixtures",9221367.912119247,477589.50375275349,null,9698957.4158720002,null,-3016649.9357211916,-181662.80075872003,null,-3198312.7364799115,6500644.6793920882]
[47,1835,"Overhead Conductors & Devices",15477455.102403877,801602.34058092104,null,16279057.442984799,null,-7622457.4125200324,-257877.22202487334,null,-7880334.6345449053,8398722.8084398936]
[47,1840,"Underground Conduit",3224033.3462831355,166977.88230638162,null,3391011.2285895171,null,-635876.32395870145,-75339.92376210574,null,-711216.24772080721,2679794.9808687097]
[47,1845,"Underground Conductors & Devices",7721896.6344643412,399929.46999078494,null,8121826.1044551264,null,-1393464.5201607146,-189874.21853559974,null,-1583338.7386963144,6538487.3657588121]
[47,1850,"Line Transformers",9622230.1182445437,498350.80336915888,null,10120580.921613703,null,-1763028.4287280571,-240079.09377017131,null,-2003107.5224982284,8117473.399115474]
[47,1855,"Services (Overhead & Underground)",7020074.9000000004,1087500,null,8107574.9000000004,null,-1841762.3099999998,-112071.40999999999,null,-1953833.7199999997,6153741.1800000006]
[47,1860,"Meters",0,null,null,0,null,0,0,null,0,0]
[47,1860,"Meters (Smart Meters)",5627849.8899999997,234500,null,5862349.8899999997,null,-2476353.79,-361163.80333333334,null,-2837517.5933333333,3024832.2966666664]
["N/A",1905,"Land",0,null,null,0,null,0,0,null,0,0]
[47,1908,"Buildings & Fixtures",0,null,null,0,null,0,0,null,0,0]
[13,1910,"Leasehold Improvements",505646.02,35000,null,540646.02,null,-44573.424545454545,-8686.176363636363,null,-53259.600909090906,487386.41909090913]
[8,1915,"Office Furniture & Equipment (10 years)",97709.45,null,null,97709.45,null,-83075.62000000001,-4110.5,null,-87186.12000000001,10523.329999999987]
[8,1915,"Office Furniture & Equipment (5 years)",0,null,null,0,null,0,0,null,0,0]
[10,1920,"Computer Equipment - Hardware",97941,null,null,97941,null,-97941,0,null,-97941,0]
[45,1920,"Computer Equip.-Hardware(Post Mar. 22/04)",3892,null,null,3892,null,-3892,0,null,-3892,0]
[45.1,1920,"Computer Equip.-Hardware(Post Mar. 19/07)",215482.31,21000,null,236482.31,null,-140348.10999999999,-38501,null,-178849.11,57633.200000000012]
[10,1930,"Transportation Equipment",3188162.9900000012,20000,null,3208162.9900000012,null,-2042979.3600000003,-202671.06,null,-2245650.4200000004,962512.57000000076]
[8,1935,"Stores Equipment",0,null,null,0,null,0,0,null,0,0]
[8,1940,"Tools, Shop & Garage Equipment",278783.09999999998,20000,null,298783.09999999998,null,-190805.96,-20180.059999999998,null,-210986.02,87797.079999999987]
[8,1945,"Measurement & Testing Equipment",31082.120000000003,null,null,31082.120000000003,null,-17693.810000000001,-3885.27,null,-21579.08,9503.0400000000009]
[8,1950,"Power Operated Equipment",224659.37,null,null,224659.37,null,-81590.759999999995,-27665.06,null,-109255.81999999999,115403.55]
[8,1955,"Communications Equipment",31915.4,null,null,31915.4,null,-6383.08,-3191.54,null,-9574.619999999999,22340.780000000002]
[8,1955,"Communication Equipment (Smart Meters)",0,null,null,0,null,0,0,null,0,0]
[8,1960,"Miscellaneous Equipment ",0,null,null,0,null,0,0,null,0,0]
[47,1970,"Load Management Controls Customer Premises",0,null,null,0,null,0,0,null,0,0]
[47,1975,"Load Management Controls Utility Premises",0,null,null,0,null,0,0,null,0,0]
[47,1980,"System Supervisor Equipment",562299.43999999994,90000,null,652299.43999999994,null,-288457.03000000003,-97656.84,null,-386113.87,266185.56999999995]
[47,1985,"Miscellaneous Fixed Assets",0,null,null,0,null,0,0,null,0,0]
[47,1990,"Other Tangible Property",0,null,null,0,null,0,0,null,0,0]
[47,1995,"Contributions & Grants",-6790434.5099999998,null,null,-6790434.5099999998,null,1423706.18,113173.91000000002,null,1536880.0899999999,-5253554.42]
[47,2440,"Deferred Revenue5",-3323915.38,-652500,null,-3976415.38,null,162012.03199999998,40502.279181818179,null,202514.31118181816,-3773901.0688181818]
[null,null,null,null,null,null,0,null,null,null,null,0,0]
[null,null,"Sub-Total",56341409.953515142,3242950,0,59584359.953515157,null,-21734751.305149302,-1842779.7808817734,0,-23577531.086031079,36006828.867484063]
[null,null,"Less Socialized Renewable Energy Generation Investments (input as negative)",-163929.26,null,null,-163929.26,null,0,null,null,0,-163929.26]
[null,null,"Less Other Non Rate-Regulated Utility Assets (input as negative)",null,null,null,0,null,null,null,null,0,0]
[null,null,"Total PP&E",56177480.693515144,3242950,0,59420430.693515159,null,-21734751.305149302,-1842779.7808817734,0,-23577531.086031079,35842899.607484065]
[null,null,"Depreciation Expense adj. from gain or loss on the retirement of assets (pool of like assets), if applicable6"]
[null,null,"Total",null,null,null,null,null,null,-1842779.7808817734]
[]
[null,null,null,null,null,null,null,null,"Less: Fully Allocated Depreciation"]
[10,null,"Transportation",null,null,null,null,null,"Transportation"]
[8,null,"Stores Equipment",null,null,null,null,null,"Stores Equipment"]
[null,null,null,null,null,null,null,null,"Net Depreciation",null,-1842779.7808817734]
[]
["Notes:"]
[]
[1,"Tables in the format outlined above covering all fixed asset accounts should be submitted for the Test Year, Bridge Year and all relevant historical years.  At a minimum , the applicant must provide data for the earlier of: 1) all historical years back to its last rebasing; or 2) at least three years of historical actuals, in addition to Bridge Year and Test Year forecasts."]
[]
[]
[2,"The \"CCA Class\" for fixed assets should agree with the CCA Class used for tax purposes in Tax Returns. Fixed Assets sub-components may be used where the underlying asset components are classified under multiple CCA Classes for tax purposes. If an applicant uses any different classes from those shown in the table, an explanation should be provided. (also see note 3)."]
[]
[]
[3,"The table may need to be customized for a utility's asset categories or for any new asset accounts announced or authorized by the Board."]
[]
[4,"The additions in column (E) must not include construction work in progress (CWIP)."]
[]
[5,"Effective on the date of IFRS adoption, customer contributions will no longer be recorded in Account 1995 Contributions & Grants, but will be recorded in Account 2440, Deferred Revenues.  "]
[]
[6,"The applicant must ensure that all asset disposals have been clearly identified in the Chapter 2 Appendices for all historic, bridge and test years.  Where a distributor for general financial reporting purposes under IFRS has accounted for the amount of gain or loss on the retirement of assets in a pool of like assets as a charge or credit to income, for reporting and rate application filings, the distributor shall reclassify such gains and losses as depreciation expense, and disclose the amount separately."]

{"sheet":"Appendix 2-BB Service Life  ","index":10,"n_rows":107,"n_cols":17,"rows_kept":107,"cut":false,"hidden":false,"merged":[[106,1,106,2],[0,15,0,16],[1,15,1,16],[2,15,2,16],[3,15,3,16],[4,15,4,16],[6,15,6,16],[14,11,14,12],[14,13,14,14],[31,2,31,4],[14,2,14,4],[14,5,14,7],[14,9,15,9],[14,10,15,10],[8,0,8,16],[9,0,9,16],[10,0,10,16],[14,15,14,16],[15,2,15,4],[35,3,35,4],[36,2,36,4],[37,2,37,4],[16,0,32,0],[16,1,18,1],[16,2,18,2],[16,3,16,4],[17,3,18,3],[25,2,25,4],[26,2,26,4],[27,2,27,4],[28,2,28,4],[29,2,29,4],[30,2,30,4],[19,1,21,1],[19,2,21,2],[19,3,19,4],[20,3,21,3],[22,1,24,1],[22,2,24,2],[22,3,22,4],[23,3,24,3],[32,2,32,4],[48,2,48,4],[56,2,56,4],[57,1,58,1],[57,2,58,2],[57,3,57,4],[58,3,58,4],[38,1,40,1],[38,2,40,2],[38,3,38,4],[39,3,39,4],[40,3,40,4],[41,1,42,1],[41,3,41,4],[42,3,42,4],[59,2,59,4],[49,2,49,4],[50,0,68,0],[50,2,50,4],[51,2,51,4],[52,2,52,4],[53,2,53,4],[54,2,54,4],[55,2,55,4],[64,2,64,4],[65,2,65,4],[66,2,66,4],[67,2,67,4],[68,2,68,4],[33,0,49,0],[33,1,35,1],[33,2,35,2],[33,3,33,4],[34,3,34,4],[43,2,43,4],[44,2,44,4],[45,2,45,4],[46,2,46,4],[47,2,47,4],[72,0,72,7],[74,2,74,4],[74,5,75,7],[78,6,78,7],[79,3,79,4],[79,6,79,7],[69,2,69,4],[60,2,60,4],[61,2,61,4],[62,1,63,1],[62,2,63,2],[62,3,62,4],[63,3,63,4],[77,1,79,1],[77,2,79,2],[77,3,77,4],[74,9,75,9],[80,2,80,4],[80,6,80,7],[81,2,81,4],[81,5,81,7],[74,13,74,14],[74,15,74,16],[75,2,75,4],[76,2,76,4],[76,6,76,7],[74,11,74,12],[77,6,77,7],[78,3,78,4],[74,10,75,10],[86,1,87,1],[86,2,87,2],[86,3,86,4],[86,6,86,7],[87,3,87,4],[87,6,87,7],[82,1,85,1],[82,2,85,2],[82,3,82,4],[82,6,82,7],[83,3,83,4],[83,6,83,7],[84,3,84,4],[84,6,84,7],[85,3,85,4],[85,6,85,7],[88,1,91,1],[88,2,91,2],[88,3,88,4],[88,6,88,7],[89,3,89,4],[89,6,89,7],[90,3,90,4],[90,6,90,7],[91,3,91,4],[91,6,91,7],[94,2,94,4],[94,6,94,7],[95,2,95,4],[95,6,95,7],[96,2,96,4],[96,6,96,7],[92,1,93,1],[92,2,93,2],[92,3,92,4],[92,6,92,7],[93,3,93,4],[93,6,93,7],[100,2,100,4],[100,6,100,7],[103,0,103,7],[97,2,97,4],[97,6,97,7],[98,2,98,4],[98,6,98,7],[99,2,99,4],[99,6,99,7]]}
[null,null,null,null,null,null,null,null,null,null,null,null,null,"File Number:",null,{"$f":"'LDC Info'!E16","v":"EB-2017-0038"}]
[null,null,null,null,null,null,null,null,null,null,null,null,null,"Exhibit:",null,4]
[null,null,null,null,null,null,null,null,null,null,null,null,null,"Tab:",null,9]
[null,null,null,null,null,null,null,null,null,null,null,null,null,"Schedule:"]
[null,null,null,null,null,null,null,null,null,null,null,null,null,"Page:",null,58]
[]
[null,null,null,null,null,null,null,null,null,null,null,null,null,"Date:",null,"Sept 12, 2017"]
[]
["Appendix 2-BB"]
["Service Life Comparison"]
["Table F-1 from Kinetrics Report1"]
[]
[]
[]
[null,null,"Asset Details",null,null,"Useful Life",null,null,null,"USoA Account Number","USoA Account Description","Current",null,"Proposed",null,"Outside Range of Min, Max TUL?"]
["Parent*","#","Category| Component | Type",null,null,"MIN UL","TUL","MAX UL",null,null,null,"Years","Rate","Years","Rate","Below Min TUL","Above Max TUL"]
["OH",1,"Fully Dressed Wood Poles","Overall",null,35,45,75,null,1830,"Poles, Towers, and Fixtures",25,{"$f":"IF(ISERROR(1/L17), \"\", 1/L17)","v":0.04},50,{"$f":"IF(ISERROR(1/N17), \"\", 1/N17)","v":0.02},{"$f":"IF(ISBLANK(N17),\"\",IF(N17<F17,\"Yes\",\"No\"))","v":"No"},{"$f":"IF(ISBLANK(N17),\"\",IF(N17>H17,\"Yes\",\"No\"))","v":"No"}]
[null,null,null,"Cross Arm","Wood",20,40,55,null,1830,"Poles, Towers, and Fixtures",25,{"$f":"IF(ISERROR(1/L18), \"\", 1/L18)","v":0.04},50,{"$f":"IF(ISERROR(1/N18), \"\", 1/N18)","v":0.02},{"$f":"IF(ISBLANK(N18),\"\",IF(N18<F18,\"Yes\",\"No\"))","v":"No"},{"$f":"IF(ISBLANK(N18),\"\",IF(N18>H18,\"Yes\",\"No\"))","v":"No"}]
[null,null,null,null,"Steel",30,70,95,null,1830,"Poles, Towers, and Fixtures",25,0.04,50,0.02,"No","No"]
[null,2,"Fully Dressed Concrete Poles","Overall",null,50,60,80,null,1830,"Poles, Towers, and Fixtures",25,0.04,50,0.02,"No","No"]
[null,null,null,"Cross Arm","Wood",20,40,55,null,1830,"Poles, Towers, and Fixtures",25,0.04,50,0.02,"No","No"]
[null,null,null,null,"Steel",30,70,95,null,1830,"Poles, Towers, and Fixtures",25,0.04,50,0.02,"No","No"]
[null,3,"Fully Dressed Steel Poles","Overall",null,60,60,80,null,1830,"Poles, Towers, and Fixtures",25,0.04,60,1.6666666666666666E-2,"No","No"]
[null,null,null,"Cross Arm","Wood",20,40,55,null,1830,"Poles, Towers, and Fixtures",25,0.04,50,0.02,"No","No"]
[null,null,null,null,"Steel",30,70,95,null,1830,"Poles, Towers, and Fixtures",25,0.04,50,0.02,"No","No"]
[null,4,"OH Line Switch",null,null,30,45,55,null,1835,"Overhead Conductors and Devices",25,0.04,60,1.6666666666666666E-2,"No","Yes"]
[null,5,"OH Line Switch Motor",null,null,15,25,25,null,null,null,null,"",null,"","",""]
[null,6,"OH Line Switch RTU",null,null,15,20,20,null,null,null,null,"",null,"","",""]
[null,7,"OH Integral Switches",null,null,35,45,60,null,1835,"Overhead Conductors and Devices",25,0.04,60,1.6666666666666666E-2,"No","No"]
[null,8,"OH Conductors",null,null,50,60,75,null,1835,"Overhead Conductors and Devices",25,0.04,60,1.6666666666666666E-2,"No","No"]
[null,9,"OH Transformers & Voltage Regulators",null,null,30,40,60,null,1850,"Line Transformers",25,0.04,40,2.5000000000000001E-2,"No","No"]
[null,10,"OH Shunt Capacitor Banks",null,null,25,30,40,null,null,null,null,"",null,"","",""]
[null,11,"Reclosers",null,null,25,40,55,null,1850,"Line Transformers",25,0.04,40,2.5000000000000001E-2,"No","No"]
["TS & MS",12,"Power Transformers","Overall",null,30,45,60,null,1850,"Line Transformers",25,0.04,40,2.5000000000000001E-2,"No","No"]
[null,null,null,"Bushing",null,10,20,30,null,1850,"Line Transformers",25,0.04,40,2.5000000000000001E-2,"No","Yes"]
[null,null,null,"Tap Changer",null,20,30,60,null,1850,"Line Transformers",25,0.04,40,2.5000000000000001E-2,"No","No"]
[null,13,"Station Service Transformer",null,null,30,45,55,null,1820,"Distribution Station Equipment - Normally Primary Below 50 kV",25,0.04,60,1.6666666666666666E-2,"No","Yes"]
[null,14,"Station Grounding Transformer",null,null,30,40,40,null,1820,"Distribution Station Equipment - Normally Primary Below 50 kV",25,0.04,60,1.6666666666666666E-2,"No","Yes"]
[null,15,"Station DC System","Overall",null,10,20,30,null,1820,"Distribution Station Equipment - Normally Primary Below 50 kV",25,0.04,60,1.6666666666666666E-2,"No","Yes"]
[null,null,null,"Battery Bank",null,10,15,15,null,1820,"Distribution Station Equipment - Normally Primary Below 50 kV",25,0.04,60,1.6666666666666666E-2,"No","Yes"]
[null,null,null,"Charger",null,20,20,30,null,1820,"Distribution Station Equipment - Normally Primary Below 50 kV",25,0.04,60,1.6666666666666666E-2,"No","Yes"]
[null,16,"Station Metal Clad Switchgear","Overall",null,30,40,60,null,1820,"Distribution Station Equipment - Normally Primary Below 50 kV",25,0.04,60,1.6666666666666666E-2,"No","No"]
[null,null,null,"Removable Breaker",null,25,40,60,null,1820,"Distribution Station Equipment - Normally Primary Below 50 kV",25,0.04,60,1.6666666666666666E-2,"No","No"]
[null,17,"Station Independent Breakers",null,null,35,45,65,null,1820,"Distribution Station Equipment - Normally Primary Below 50 kV",25,0.04,60,1.6666666666666666E-2,"No","No"]
[null,18,"Station Switch",null,null,30,50,60,null,1820,"Distribution Station Equipment - Normally Primary Below 50 kV",25,0.04,60,1.6666666666666666E-2,"No","No"]
[null,19,"Electromechanical Relays",null,null,25,35,50,null,1820,"Distribution Station Equipment - Normally Primary Below 50 kV",25,0.04,60,1.6666666666666666E-2,"No","Yes"]
[null,20,"Solid State Relays",null,null,10,30,45,null,null,null,null,"",null,"","",""]
[null,21,"Digital & Numeric Relays",null,null,15,20,20,null,null,null,null,"",null,"","",""]
[null,22,"Rigid Busbars",null,null,30,55,60,null,1820,"Distribution Station Equipment - Normally Primary Below 50 kV",25,0.04,60,1.6666666666666666E-2,"No","No"]
[null,23,"Steel Structure",null,null,35,50,90,null,1820,"Distribution Station Equipment - Normally Primary Below 50 kV",25,0.04,60,1.6666666666666666E-2,"No","No"]
["UG",24,"Primary Paper Insulated Lead Covered (PILC) Cables",null,null,60,65,75,null,1845,"Underground Conductors and Devices",25,0.04,40,2.5000000000000001E-2,"Yes","No"]
[null,25,"Primary Ethylene-Propylene Rubber (EPR) Cables",null,null,20,25,25,null,null,null,null,"",null,"","",""]
[null,26,"Primary Non-Tree Retardant (TR) Cross Linked \nPolyethylene (XLPE) Cables Direct Buried",null,null,20,25,30,null,1845,"Underground Conductors and Devices",25,0.04,40,2.5000000000000001E-2,"No","Yes"]
[null,27,"Primary Non-TR XLPE Cables in Duct",null,null,20,25,30,null,1845,"Underground Conductors and Devices",25,0.04,40,2.5000000000000001E-2,"No","Yes"]
[null,30,"Secondary PILC Cables",null,null,70,75,80,null,null,null,null,"",null,"","",""]
[null,31,"Secondary Cables Direct Buried",null,null,25,35,40,null,1845,"Underground Conductors and Devices",25,0.04,40,2.5000000000000001E-2,"No","No"]
[null,32,"Secondary Cables in Duct",null,null,35,40,60,null,1845,"Underground Conductors and Devices",25,0.04,40,2.5000000000000001E-2,"No","No"]
[null,33,"Network Tranformers","Overall",null,20,35,50,null,1850,"Line Transformers",25,0.04,40,2.5000000000000001E-2,"No","No"]
[null,null,null,"Protector",null,20,35,40,null,1850,"Line Transformers",25,0.04,40,2.5000000000000001E-2,"No","No"]
[null,34,"Pad-Mounted Transformers",null,null,25,40,45,null,1850,"Line Transformers",25,0.04,40,2.5000000000000001E-2,"No","No"]
[null,35,"Submersible/Vault Transformers",null,null,25,35,45,null,1850,"Line Transformers",25,0.04,40,2.5000000000000001E-2,"No","No"]
[null,36,"UG Foundation",null,null,35,55,70,null,1850,"Line Transformers",25,0.04,40,2.5000000000000001E-2,"No","No"]
[null,37,"UG Vaults","Overall",null,40,60,80,null,1850,"Line Transformers",25,0.04,40,2.5000000000000001E-2,"No","No"]
[null,null,null,"Roof",null,20,30,45,null,1850,"Line Transformers",25,0.04,40,2.5000000000000001E-2,"No","No"]
[null,38,"UG Vault Switches",null,null,20,35,50,null,1850,"Line Transformers",25,0.04,40,2.5000000000000001E-2,"No","No"]
[null,39,"Pad-Mounted Switchgear",null,null,20,30,45,null,1850,"Line Transformers",25,0.04,40,2.5000000000000001E-2,"No","No"]
[null,40,"Ducts",null,null,30,50,85,null,1840,"Underground Conduit",25,0.04,45,2.2222222222222223E-2,"No","No"]
[null,41,"Concrete Encased Duct Banks",null,null,35,55,80,null,1840,"Underground Conduit",25,0.04,45,2.2222222222222223E-2,"No","No"]
[null,42,"Cable Chambers",null,null,50,60,80,null,null,null,null,"",null,"","",""]
["S",43,"Remote SCADA",null,null,15,20,30,null,null,null,null,"",null,"","",""]
[]
[]
["Table F-2 from Kinetrics Report1"]
[]
[null,null,"Asset Details",null,null,"Useful Life Range",null,null,null,"USoA Account Number","USoA Account Description","Current",null,"Proposed",null,"Outside Range of Min, Max TUL?"]
[null,"#","Category| Component | Type",null,null,null,null,null,null,null,null,"Years","Rate","Years","Rate","Below Min Range","Above Max Range"]
[null,1,"Office Equipment",null,null,5,15,null,null,1915,"Office Furniture and Equipment",10,{"$f":"IF(ISERROR(1/L77), \"\", 1/L77)","v":0.1},10,{"$f":"IF(ISERROR(1/N77), \"\", 1/N77)","v":0.1},{"$f":"IF(ISBLANK(N77),\"\",IF(N77<F77,\"Yes\",\"No\"))","v":"No"},{"$f":"IF(ISBLANK(N77),\"\",IF(N77>G77,\"Yes\",\"No\"))","v":"No"}]
[null,2,"Vehicles","Trucks & Buckets",null,5,15,null,null,1930,"Transportation Equipment",8,{"$f":"IF(ISERROR(1/L78), \"\", 1/L78)","v":0.125},10,{"$f":"IF(ISERROR(1/N78), \"\", 1/N78)","v":0.1},{"$f":"IF(ISBLANK(N78),\"\",IF(N78<F78,\"Yes\",\"No\"))","v":"No"},{"$f":"IF(ISBLANK(N78),\"\",IF(N78>G78,\"Yes\",\"No\"))","v":"No"}]
[null,null,null,"Trailers",null,5,20,null,null,1930,"Transportation Equipment",8,0.125,10,0.1,"No","No"]
[null,null,null,"Vans",null,5,10,null,null,1930,"Transportation Equipment",8,0.125,8,0.125,"No","No"]
[null,3,"Administrative Buildings",null,null,50,75,null,null,"n/a",null,null,"",null,"","",""]
[null,4,"Leasehold Improvements",null,null,"Lease dependent",null,null,null,1910,"Leasehold Improvements",25,0.04,55,1.8181818181818181E-2]
[null,5,"Station Buildings","Station Buildings",null,50,75,null,null,1808,"Buildings and Fixtures",25,0.04,55,1.8181818181818181E-2,"No","No"]
[null,null,null,"Parking",null,25,30,null,null,1808,"Buildings and Fixtures",25,0.04,55,1.8181818181818181E-2,"No","Yes"]
[null,null,null,"Fence",null,25,60,null,null,1808,"Buildings and Fixtures",25,0.04,55,1.8181818181818181E-2,"No","No"]
[null,null,null,"Roof",null,20,30,null,null,1808,"Buildings and Fixtures",25,0.04,55,1.8181818181818181E-2,"No","Yes"]
[null,6,"Computer Equipment","Hardware",null,3,5,null,null,1920,"Computer Equipment - Hardware",5,0.2,5,0.2,"No","No"]
[null,null,null,"Software",null,2,5,null,null,1611,"Computer Software",3,0.33333333333333331,3,0.33333333333333331,"No","No"]
[null,7,"Equipment","Power Operated",null,5,10,null,null,1950,"Power Operated Equipment",10,0.1,8,0.125,"No","No"]
[null,null,null,"Stores",null,5,10,null,null,null,null,null,"",null,"","",""]
[null,null,null,"Tools, Shop, Garage Equipment",null,5,10,null,null,1940,"Tools, Shop and Garage Equipment",10,0.1,8,0.125,"No","No"]
[null,null,null,"Measurement & Testing Equipment",null,5,10,null,null,1945,"Measurement and Testing Equipment",10,0.1,8,0.125,"No","No"]
[null,8,"Communication","Towers",null,60,70,null,null,null,null,null,"",null,"","",""]
[null,null,null,"Wireless",null,2,10,null,null,1955,"Communication Equipment",0,"",5,0.2,"No","No"]
[null,9,"Residential Energy Meters",null,null,25,35,null,null,null,null,null,"",null,"","",""]
[null,10,"Industrial/Commercial Energy Meters",null,null,25,35,null,null,1860,"Meters",25,0.04,25,0.04,"No","No"]
[null,11,"Wholesale Energy Meters",null,null,15,30,null,null,1860,"Meters",25,0.04,25,0.04,"No","No"]
[null,12,"Current & Potential Transformer (CT & PT)",null,null,35,50,null,null,1860,"Meters",25,0.04,null,"","",""]
[null,13,"Smart Meters",null,null,5,15,null,null,1860,"Meters",25,0.04,12,8.3333333333333329E-2,"No","No"]
[null,14,"Repeaters - Smart Metering",null,null,10,15,null,null,1860,"Meters",25,0.04,12,8.3333333333333329E-2,"No","No"]
[null,15,"Data Collectors - Smart Metering",null,null,15,20,null,null,1955,"Meters",25,0.04,5,0.2,"Yes","No"]
[]
[]
["* TS & MS = Transformer and Municipal Stations UG = Underground Systems S = Monitoring and Control Systems"]
[]
["Note 1:","Tables F-1 and F-2 above are to be used as a reference in order to complete columns J, K, L and N."]
[null,"See pages 17-19 of Kinetrics Report"]

{"sheet":"App.2-C_DepExp","index":11,"n_rows":547,"n_cols":25,"rows_kept":547,"cut":false,"hidden":false,"merged":[[541,1,541,18],[542,1,542,18],[544,1,544,18],[490,0,491,0],[490,1,491,1],[535,1,535,18],[539,1,539,18],[540,1,540,18],[485,0,485,1],[485,2,485,16],[486,0,486,1],[486,2,486,16],[489,0,489,1],[489,2,489,8],[489,9,489,12],[489,13,489,16],[477,1,477,18],[483,0,483,1],[483,2,483,16],[484,0,484,1],[484,2,484,16],[468,1,468,18],[472,1,472,18],[473,1,473,18],[474,1,474,18],[475,1,475,18],[422,0,422,1],[422,2,422,8],[422,9,422,12],[422,13,422,16],[423,0,424,0],[423,1,424,1],[417,0,417,1],[417,2,417,16],[418,0,418,1],[418,2,418,16],[419,0,419,1],[419,2,419,16],[407,1,407,18],[408,1,408,18],[410,1,410,18],[416,0,416,1],[416,2,416,16],[356,0,357,0],[356,1,357,1],[401,1,401,18],[405,1,405,18],[406,1,406,18],[351,0,351,1],[351,2,351,16],[352,0,352,1],[352,2,352,16],[355,0,355,1],[355,2,355,8],[355,9,355,12],[355,13,355,16],[343,1,343,18],[349,0,349,1],[349,2,349,16],[350,0,350,1],[350,2,350,16],[334,1,334,18],[338,1,338,18],[339,1,339,18],[340,1,340,18],[341,1,341,18],[288,0,288,1],[288,2,288,8],[288,9,288,12],[288,13,288,16],[289,0,290,0],[289,1,290,1],[283,0,283,1],[283,2,283,16],[284,0,284,1],[284,2,284,16],[285,0,285,1],[285,2,285,16],[272,1,272,18],[273,1,273,18],[275,1,275,18],[282,0,282,1],[282,2,282,16],[221,0,222,0],[221,1,222,1],[266,1,266,18],[270,1,270,18],[271,1,271,18],[206,1,206,18],[197,1,197,18],[201,1,201,18],[202,1,202,18],[203,1,203,18],[204,1,204,18],[214,0,214,1],[214,2,214,16],[215,0,215,1],[215,2,215,16],[216,0,216,1],[216,2,216,16],[217,0,217,1],[217,2,217,16],[220,0,220,1],[220,2,220,8],[220,9,220,12],[220,13,220,16],[152,0,152,1],[152,2,152,8],[152,9,152,12],[152,13,152,16],[153,0,154,0],[153,1,154,1],[147,0,147,1],[147,2,147,16],[148,0,148,1],[148,2,148,16],[149,0,149,1],[149,2,149,16],[136,1,136,18],[137,1,137,18],[139,1,139,18],[146,0,146,1],[146,2,146,16],[86,0,87,0],[86,1,87,1],[130,1,130,18],[134,1,134,18],[135,1,135,18],[82,0,82,1],[82,2,82,16],[85,0,85,1],[85,2,85,8],[85,9,85,12],[85,13,85,16],[79,0,79,1],[79,2,79,16],[80,0,80,1],[80,2,80,16],[81,0,81,1],[81,2,81,16],[14,0,14,1],[14,2,14,16],[8,0,8,18],[9,0,9,18],[10,0,10,18],[13,0,13,1],[13,2,13,16],[71,1,71,18],[73,1,73,18],[20,0,21,0],[20,1,21,1],[64,1,64,18],[68,1,68,18],[69,1,69,18],[70,1,70,18],[15,0,15,1],[15,2,15,16],[16,0,16,1],[16,2,16,16],[19,2,19,8],[19,9,19,12],[19,13,19,16],[19,0,19,1]]}
[]
[]
[]
[]
[]
[]
[]
[]
["Appendix 2-C",null,null,null,null,null,null,null,null,null,null,null,null,null,null,null,null,null,null,null,null,null,null,null,"CGAAP"]
["Depreciation and Amortization Expense",null,null,null,null,null,null,null,null,null,null,null,null,null,null,null,null,null,null,null,null,null,null,null,"Revised CGAAP"]
[null,null,null,null,null,null,null,null,null,null,null,null,null,null,null,null,null,null,null,null,null,null,null,null,"MIFRS"]
["This appendix is to be completed in conjunction with the accounting instructions in Appendix 2-B"]
[]
["Scenario that applies",null,"Applicable Years and Accounting Standard",null,null,null,null,null,null,null,null,null,null,null,null,null,null,"Year Reflected in Schedule Below","Accounting Standard Reflected in Schedule Below",null,null,null,null,null,2012]
["Rebasing for the first time with depreciation policy changes made in 2012.",null,"This appendix must be duplicated and completed for the years 2012 to 2018. The appendix for 2012 is to be completed under CGAAP (prior to changes in depreciation policies). The appendix for 2012 to 2014 must be completed under Revised CGAAP (after changes in depreciation policies). The appendix for 2014 to 2018 is to be completed under MIFRS (2014 if changes to MIFRS are material).",null,null,null,null,null,null,null,null,null,null,null,null,null,null,null,null,null,null,null,null,null,2013]
["Rebasing for the first time with depreciation policy changes made in 2013.",null,"This appendix must be duplicated and completed for the years 2013 to 2018. The appendix for 2013 is to be completed under CGAAP (prior to changes in depreciation policies). The appendix for 2013 to 2014 must be completed under Revised CGAAP (after changes in depreciation policies). The appendix for 2014 to 2018 is to be completed under MIFRS (2014 if changes to MIFRS are material).",null,null,null,null,null,null,null,null,null,null,null,null,null,null,2013,"CGAAP",null,null,null,null,null,2014]
["Already rebased with depreciation policy changes in a prior rate application",null,"This appendix must be completed for 2014 to 2018. The appendix for 2014 is to be completed under Revised CGAAP (after changes in depreciation policies). The appendix for 2014 to 2018 is to be completed under MIFRS (2014 if changes to MIFRS are material).",null,null,null,null,null,null,null,null,null,null,null,null,null,null,null,null,null,null,null,null,null,2015]
[null,null,null,null,null,null,null,null,null,null,null,null,null,null,null,null,null,null,null,null,null,null,null,null,2016]
[null,null,null,null,null,null,null,null,null,null,null,null,null,null,null,null,null,null,null,null,null,null,null,null,2017]
[null,null,"Book Values",null,null,null,null,null,null,"Service Lives",null,null,null,"Depreciation Expense",null,null,null,null,null,null,null,null,null,null,2018]
["Account","Description","Opening Net  Book Value of Existing Assets as at Date of Policy Change (Jan. 1) 1","Less Fully Depreciated 7","Net Amount of Existing Assets Before Policy Change to be Depreciated ","Opening Gross Book Value of Assets Acquired After Policy Change 2","Less Fully Depreciated 8","Net Amount of Assets Acquired After Policy Change to be Depreciated ","Current Year Additions","Average Remaining Life of Assets Existing Before Policy Change 3","Depreciation Rate Assets Acquired After Policy Change","Life of Assets Acquired After Policy Change 4","Depreciation Rate on New Additions","Depreciation Expense on Assets Existing Before Policy Change","Depreciation Expense on Assets Acquired After Policy Change","Depreciation Expense on Current Year Additions 5","Total Current Year Depreciation Expense ","Depreciation Expense per Appendix 2-BA Fixed Assets, Column J \n ","Variance 6"]
[null,null,"a","b","c = a-b","d","e","f = d- e","g","h","i = 1/h","j","k = 1/j","l = c/h","m = f/j","n = g*0.5/j","o = l+m+n","p","q = p-o"]
[1611,"Computer Software (Formally known as Account 1925)",{"$f":"'App.2-BA_Fixed Asset Cont'!M17","v":455375.65},{"$f":"3639.8+4576.29","v":8216.09},{"$f":"C23-D23","v":447159.56},{"$f":"I23","v":54670.75},null,{"$f":"F23-G23","v":54670.75},54670.75,{"$f":"(C23/'App.2-BA_Fixed Asset Cont'!D107)*L23","v":1.2585664388363336},{"$f":"IF(J23=0,0,1/J23)","v":0.79455479595069822},3,{"$f":"IF(L23=0,0,1/L23)","v":0.33333333333333331},{"$f":"IF(J23=0,0,+E23/J23)","v":355292.772953204},{"$f":"IF(L23=0,0,+H23/L23)","v":18223.583333333332},{"$f":"IF(L23=0,0,+(I23*0.5)/L23)","v":9111.7916666666661},{"$f":"IF(ISERROR(+N23+O23+P23), 0, +N23+O23+P23)","v":382628.147953204},{"$f":"-VLOOKUP(A23,'App.2-BA_Fixed Asset Cont'!$B$107:$M$145,11,)","v":737540.97},{"$f":"IF(ISERROR(+R23-122), 0, +R23-Q23)","v":354912.82204679598}]
[1612,"Land Rights (Formally known as Account 1906)",{"$f":"'App.2-BA_Fixed Asset Cont'!M18","v":42932.04},null,{"$f":"C24-D24","v":42932.04},{"$f":"I24","v":947},null,{"$f":"F24-G24","v":947},947,null,{"$f":"IF(J24=0,0,1/J24)","v":0},null,{"$f":"IF(L24=0,0,1/L24)","v":0},{"$f":"IF(J24=0,0,+E24/J24)","v":0},{"$f":"IF(L24=0,0,+H24/L24)","v":0},{"$f":"IF(L24=0,0,+(I24*0.5)/L24)","v":0},{"$f":"IF(ISERROR(+N24+O24+P24), 0, +N24+O24+P24)","v":0},{"$f":"-VLOOKUP(A24,'App.2-BA_Fixed Asset Cont'!$B$107:$M$145,11,)","v":0},{"$f":"IF(ISERROR(+R24-122), 0, +R24-Q24)","v":0}]
[1805,"Land",{"$f":"'App.2-BA_Fixed Asset Cont'!M19","v":103344.08},null,103344.08,695,null,695,695,null,0,null,0,0,{"$f":"IF(L25=0,0,+H25/L25)","v":0},0,0,{"$f":"-VLOOKUP(A25,'App.2-BA_Fixed Asset Cont'!$B$107:$M$145,11,)","v":0},0]
[1808,"Buildings",{"$f":"'App.2-BA_Fixed Asset Cont'!M20","v":124624.34},null,124624.34,24917.26,null,24917.26,24917.26,{"$f":"(C26/'App.2-BA_Fixed Asset Cont'!D110)*L26","v":38.159853967551165},2.6205551018364474E-2,60,1.6666666666666666E-2,3265.8495000000003,415.28766666666667,207.64383333333333,3888.7810000000004,{"$f":"-VLOOKUP(A26,'App.2-BA_Fixed Asset Cont'!$B$107:$M$145,11,)","v":75074.06},71185.278999999995]
[1810,"Leasehold Improvements",{"$f":"'App.2-BA_Fixed Asset Cont'!M21","v":0},null,0,0,null,0,0,null,0,null,0,0,0,0,0,{"$f":"-VLOOKUP(A27,'App.2-BA_Fixed Asset Cont'!$B$107:$M$145,11,)","v":0},0]
[1815,"Transformer Station Equipment >50 kV",{"$f":"'App.2-BA_Fixed Asset Cont'!M22","v":0},null,0,0,null,0,0,null,0,null,0,0,0,0,0,{"$f":"-VLOOKUP(A28,'App.2-BA_Fixed Asset Cont'!$B$107:$M$145,11,)","v":0},0]
[1820,"Distribution Station Equipment <50 kV",{"$f":"'App.2-BA_Fixed Asset Cont'!M23","v":416938.75999999995},null,416938.75999999995,16590.587095652314,null,16590.587095652314,16590.587095652314,{"$f":"(C29/'App.2-BA_Fixed Asset Cont'!D113)*'App.2-C_DepExp'!L29","v":41.370584874984687},2.4171763658208861E-2,60,1.6666666666666666E-2,10078.145166666665,276.50978492753859,138.25489246376929,10492.909844057973,{"$f":"-VLOOKUP(A29,'App.2-BA_Fixed Asset Cont'!$B$107:$M$145,11,)","v":198234.41},187741.50015594202]
[1825,"Storage Battery Equipment",{"$f":"'App.2-BA_Fixed Asset Cont'!M24","v":0},null,0,0,null,0,0,null,0,null,0,0,0,0,0,{"$f":"-VLOOKUP(A30,'App.2-BA_Fixed Asset Cont'!$B$107:$M$145,11,)","v":0},0]
[1830,"Poles, Towers & Fixtures",{"$f":"'App.2-BA_Fixed Asset Cont'!M25","v":3625291.0299999993},null,3625291.0299999993,508874.06476657465,null,508874.06476657465,508874.06476657465,{"$f":"C31/'App.2-BA_Fixed Asset Cont'!D115*'App.2-C_DepExp'!L31","v":29.952497021667785},3.338619812820931E-2,50,0.02,121034.68459999999,10177.481295331492,5088.7406476657461,136300.90654299723,{"$f":"-VLOOKUP(A31,'App.2-BA_Fixed Asset Cont'!$B$107:$M$145,11,)","v":2544985.02},2408684.1134570027]
[1835,"Overhead Conductors & Devices",{"$f":"'App.2-BA_Fixed Asset Cont'!M26","v":3973942.9299999988},null,3973942.9299999988,770131.24864008767,null,770131.24864008767,770131.24864008767,{"$f":"C32/'App.2-BA_Fixed Asset Cont'!D116*'App.2-C_DepExp'!L32","v":21.073729596458545},4.7452445255255181E-2,60,1.6666666666666666E-2,188573.30933333331,12835.520810668128,6417.7604053340638,207826.59054933549,{"$f":"-VLOOKUP(A32,'App.2-BA_Fixed Asset Cont'!$B$107:$M$145,11,)","v":7035075.7400000002},6827249.1494506644]
[1840,"Underground Conduit",{"$f":"'App.2-BA_Fixed Asset Cont'!M27","v":2397564.6900000004},null,2397564.6900000004,46781.473294557421,null,46781.473294557421,46781.473294557421,{"$f":"C33/'App.2-BA_Fixed Asset Cont'!D117*'App.2-C_DepExp'!L33","v":40.150166128913021},2.4906497193292507E-2,45,2.2222222222222223E-2,59714.938222222227,1039.5882954346093,519.79414771730467,61274.320665374144,{"$f":"-VLOOKUP(A33,'App.2-BA_Fixed Asset Cont'!$B$107:$M$145,11,)","v":355353.72},294079.39933462581]
[1845,"Underground Conductors & Devices",{"$f":"'App.2-BA_Fixed Asset Cont'!M28","v":4872044.54},null,4872044.54,379359.97891090001,null,379359.97891090001,379359.97891090001,{"$f":"C34/'App.2-BA_Fixed Asset Cont'!D118*'App.2-C_DepExp'!L34","v":38.61469649583956},2.5896875820524509E-2,45,2.2222222222222223E-2,126170.73244444445,8430.2217535755553,4215.1108767877777,138816.06507480779,{"$f":"-VLOOKUP(A34,'App.2-BA_Fixed Asset Cont'!$B$107:$M$145,11,)","v":953898.08},815082.01492519211]
[1850,"Line Transformers",{"$f":"'App.2-BA_Fixed Asset Cont'!M29","v":6053932.2699999996},null,6053932.2699999996,649660.91936591454,null,649660.91936591454,649660.91936591454,{"$f":"C35/'App.2-BA_Fixed Asset Cont'!D119*'App.2-C_DepExp'!L35","v":33.26304547186934},3.0063392747537297E-2,40,2.5000000000000001E-2,182001.74349999998,16241.522984147863,8120.7614920739315,206364.02797622178,{"$f":"-VLOOKUP(A35,'App.2-BA_Fixed Asset Cont'!$B$107:$M$145,11,)","v":1267670.1499999999},1061306.122023778]
[1855,"Services (Overhead & Underground)",{"$f":"'App.2-BA_Fixed Asset Cont'!M30","v":2484787.5800000005},null,2484787.5800000005,332065.1963997269,null,332065.1963997269,332065.1963997269,{"$f":"C36/'App.2-BA_Fixed Asset Cont'!D120*'App.2-C_DepExp'!L36","v":38.1937801381508},2.6182273563467612E-2,60,1.6666666666666666E-2,65057.388166666678,5534.4199399954487,2767.2099699977243,73359.01807665985,{"$f":"-VLOOKUP(A36,'App.2-BA_Fixed Asset Cont'!$B$107:$M$145,11,)","v":1486280.4300000002},1412921.4119233403]
[1860,"Meters",{"$f":"'App.2-BA_Fixed Asset Cont'!M31","v":2475115.7000000002},null,2475115.7000000002,35278.005015968803,null,35278.005015968803,35278.005015968803,{"$f":"C37/'App.2-BA_Fixed Asset Cont'!D121*'App.2-C_DepExp'!L37","v":37.909893238477771},2.6378338596454297E-2,25,0.04,65289.440000000002,1411.1202006387521,705.56010031937603,67406.120300958122,{"$f":"-VLOOKUP(A37,'App.2-BA_Fixed Asset Cont'!$B$107:$M$145,11,)","v":1198433.1299999999},1131027.0096990417]
[1860,"Meters (Smart Meters)",{"$f":"'App.2-BA_Fixed Asset Cont'!M32","v":0},null,0,229651.07798532827,null,229651.07798532827,229651.07798532827,{"$f":"C38/'App.2-BA_Fixed Asset Cont'!D122*'App.2-C_DepExp'!L38","v":0},0,12,8.3333333333333329E-2,0,19137.589832110691,9568.7949160553453,28706.384748166034,null,-28706.384748166034]
[1905,"Land",{"$f":"'App.2-BA_Fixed Asset Cont'!M33","v":0},null,0,0,null,0,0,null,0,null,0,0,0,0,0,{"$f":"-VLOOKUP(A39,'App.2-BA_Fixed Asset Cont'!$B$107:$M$145,11,)","v":0},0]
[1908,"Buildings & Fixtures",{"$f":"'App.2-BA_Fixed Asset Cont'!M34","v":0},null,0,0,null,0,0,null,0,null,0,0,0,0,0,{"$f":"-VLOOKUP(A40,'App.2-BA_Fixed Asset Cont'!$B$107:$M$145,11,)","v":0},0]
[1910,"Leasehold Improvements",{"$f":"'App.2-BA_Fixed Asset Cont'!M35","v":174258.88},null,174258.88,53272.5,null,53272.5,53272.5,{"$f":"C41/'App.2-BA_Fixed Asset Cont'!D125*'App.2-C_DepExp'!L41","v":51.12765250107438},1.9558887433350991E-2,55,1.8181818181818181E-2,3408.3098181818182,968.59090909090912,484.29545454545456,4861.1961818181826,{"$f":"-VLOOKUP(A41,'App.2-BA_Fixed Asset Cont'!$B$107:$M$145,11,)","v":17090.759999999998},12229.563818181816]
[1915,"Office Furniture & Equipment (10 years)",{"$f":"'App.2-BA_Fixed Asset Cont'!M36","v":23165.340000000011},null,23165.340000000011,3059.23,null,3059.23,3059.23,{"$f":"C42/'App.2-BA_Fixed Asset Cont'!D126*'App.2-C_DepExp'!L42","v":2.6823045874551048},0.37281373811047008,10,0.1,8636.3570000000018,305.923,152.9615,9095.2415000000019,{"$f":"-VLOOKUP(A42,'App.2-BA_Fixed Asset Cont'!$B$107:$M$145,11,)","v":68291.45},59196.208499999993]
[1915,"Office Furniture & Equipment (5 years)",{"$f":"'App.2-BA_Fixed Asset Cont'!M37","v":0},null,0,0,null,0,null,null,0,null,0,0,0,0,0,null,0]
[1920,"Computer Equipment - Hardware",{"$f":"'App.2-BA_Fixed Asset Cont'!M38","v":0},null,0,0,null,0,0,{"$f":"(C44/'App.2-BA_Fixed Asset Cont'!D128)*'Appendix 2-BB Service Life  '!N109","v":0},0,null,0,0,0,0,0,{"$f":"-'App.2-BA_Fixed Asset Cont'!L129","v":3892},3892]
[1920,"Computer Equip.-Hardware(Post Mar. 22/04)",{"$f":"'App.2-BA_Fixed Asset Cont'!M39","v":0},null,0,0,null,0,0,{"$f":"(C45/'App.2-BA_Fixed Asset Cont'!D129)*'Appendix 2-BB Service Life  '!N110","v":0},0,null,0,0,0,0,0,{"$f":"-'App.2-BA_Fixed Asset Cont'!L130","v":19443.16},19443.16]
[1920,"Computer Equip.-Hardware(Post Mar. 19/07)",{"$f":"'App.2-BA_Fixed Asset Cont'!M40","v":41332},null,41332,57213.91,null,57213.91,57213.91,{"$f":"C46/'App.2-BA_Fixed Asset Cont'!D130*'App.2-C_DepExp'!L46","v":4.4999455634186178},0.22222491048098322,5,0.2,9184.9999999999982,11442.782000000001,5721.3910000000005,26349.172999999999,{"$f":"-VLOOKUP(A46,'App.2-BA_Fixed Asset Cont'!$B$107:$M$145,11,)","v":97941},71591.827000000005]
[1930,"Transportation Equipment",{"$f":"'App.2-BA_Fixed Asset Cont'!M41","v":925955.20000000088},null,925955.20000000088,386631.99,null,386631.99,386631.99,{"$f":"C47/'App.2-BA_Fixed Asset Cont'!D131*'App.2-C_DepExp'!L47","v":2.7724997179084605},0.36068533877232911,8,0.125,333978.46500000008,48328.998749999999,24164.499374999999,406471.96312500013,{"$f":"-VLOOKUP(A47,'App.2-BA_Fixed Asset Cont'!$B$107:$M$145,11,)","v":1960131.51},1553659.546875]
[1935,"Stores Equipment",{"$f":"'App.2-BA_Fixed Asset Cont'!M42","v":0},null,0,0,null,0,0,null,0,null,0,0,0,0,0,{"$f":"-VLOOKUP(A48,'App.2-BA_Fixed Asset Cont'!$B$107:$M$145,11,)","v":0},0]
[1940,"Tools, Shop & Garage Equipment",{"$f":"'App.2-BA_Fixed Asset Cont'!M43","v":79939.59},null,79939.59,16441.830000000002,null,16441.830000000002,16441.830000000002,{"$f":"C49/'App.2-BA_Fixed Asset Cont'!D133*'App.2-C_DepExp'!L49","v":4.5472517569780111},0.21991304934138389,10,0.1,17579.758999999998,1644.1830000000002,822.09150000000011,20046.033499999998,{"$f":"-VLOOKUP(A49,'App.2-BA_Fixed Asset Cont'!$B$107:$M$145,11,)","v":117688.31},97642.276500000007]
[1945,"Measurement & Testing Equipment",{"$f":"'App.2-BA_Fixed Asset Cont'!M44","v":11001.12},null,11001.12,0,null,0,0,{"$f":"C50/'App.2-BA_Fixed Asset Cont'!D134*'App.2-C_DepExp'!L50","v":6.0854812434138283},0.16432554139942115,8,0.125,1807.7650000000003,0,0,1807.7650000000003,{"$f":"-VLOOKUP(A50,'App.2-BA_Fixed Asset Cont'!$B$107:$M$145,11,)","v":5268.98},3461.2149999999992]
[1950,"Power Operated Equipment",{"$f":"'App.2-BA_Fixed Asset Cont'!M45","v":51893.599999999999},null,51893.599999999999,0,null,0,0,{"$f":"C51/'App.2-BA_Fixed Asset Cont'!D135*'App.2-C_DepExp'!L51","v":6.4775302462451592},0.15437982718485516,8,0.125,8011.3249999999998,0,0,8011.3249999999998,{"$f":"-VLOOKUP(A51,'App.2-BA_Fixed Asset Cont'!$B$107:$M$145,11,)","v":20208.78},12197.454999999998]
[1955,"Communications Equipment",{"$f":"'App.2-BA_Fixed Asset Cont'!M46","v":0},null,0,0,null,0,0,null,0,null,0,0,0,0,0,{"$f":"-VLOOKUP(A52,'App.2-BA_Fixed Asset Cont'!$B$107:$M$145,11,)","v":0},0]
[1955,"Communication Equipment (Smart Meters)",{"$f":"'App.2-BA_Fixed Asset Cont'!M47","v":0},null,0,0,null,0,0,null,0,null,0,0,0,0,0,{"$f":"-VLOOKUP(A53,'App.2-BA_Fixed Asset Cont'!$B$107:$M$145,11,)","v":0},0]
[1960,"Miscellaneous Equipment ",{"$f":"'App.2-BA_Fixed Asset Cont'!M48","v":0},null,0,0,null,0,0,null,0,null,0,0,0,0,0,{"$f":"-VLOOKUP(A54,'App.2-BA_Fixed Asset Cont'!$B$107:$M$145,11,)","v":0},0]
[1970,"Load Management Controls Customer Premises",{"$f":"'App.2-BA_Fixed Asset Cont'!M49","v":0},null,0,0,null,0,0,null,0,null,0,0,0,0,0,{"$f":"-VLOOKUP(A55,'App.2-BA_Fixed Asset Cont'!$B$107:$M$145,11,)","v":0},0]
[1975,"Load Management Controls Utility Premises",{"$f":"'App.2-BA_Fixed Asset Cont'!M50","v":0},null,0,0,null,0,0,null,0,null,0,0,0,0,0,{"$f":"-VLOOKUP(A56,'App.2-BA_Fixed Asset Cont'!$B$107:$M$145,11,)","v":0},0]
[1980,"System Supervisor Equipment",{"$f":"'App.2-BA_Fixed Asset Cont'!M51","v":203266.79},null,203266.79,42215.85,null,42215.85,42215.85,{"$f":"C57/'App.2-BA_Fixed Asset Cont'!D141*'App.2-C_DepExp'!L57","v":4.7500055967152353},0.21052606773590513,5,0.2,42792.957999999999,8443.17,4221.585,55457.712999999996,{"$f":"-VLOOKUP(A57,'App.2-BA_Fixed Asset Cont'!$B$107:$M$145,11,)","v":57712.75},2255.0370000000039]
[1985,"Miscellaneous Fixed Assets",{"$f":"'App.2-BA_Fixed Asset Cont'!M52","v":0},null,0,0,null,0,0,null,0,null,0,0,0,0,0,{"$f":"-VLOOKUP(A58,'App.2-BA_Fixed Asset Cont'!$B$107:$M$145,11,)","v":0},0]
[1990,"Other Tangible Property",{"$f":"'App.2-BA_Fixed Asset Cont'!M53","v":0},null,0,0,null,0,0,null,0,null,0,0,0,0,0,{"$f":"-VLOOKUP(A59,'App.2-BA_Fixed Asset Cont'!$B$107:$M$145,11,)","v":0},0]
[1995,"Contributions & Grants",{"$f":"'App.2-BA_Fixed Asset Cont'!M54","v":-4479752.2},null,-4479752.2,-1446296.2299999995,null,-1446296.2299999995,-1446296.2299999995,{"$f":"C60/'App.2-BA_Fixed Asset Cont'!D144*'App.2-C_DepExp'!L60","v":20.956382326244746},4.7718159767855019E-2,25,0.04,-213765.53120000003,-57851.849199999982,-28925.924599999991,-300543.30499999999,{"$f":"-VLOOKUP(A60,'App.2-BA_Fixed Asset Cont'!$B$107:$M$145,11,)","v":-971010.54},-670467.2350000001]
[null,"Total",{"$f":"SUM(C23:C60)","v":24056953.93},8216.09,24048737.84,2162161.6414747112,0,2162161.6414747112,2162161.6414747112,null,null,null,null,{"$f":"SUM(N23:N60)","v":1388113.4115047192},107004.644355921,53502.322177960501,1548620.3780386008,17249203.870000001,15700583.491961397]
[]
[]
["General:","Applicants are to complete this appendix to show the reasonability of the depreciation expense that is included in rate base via. Accumulated depreciation and the revenue requirement."]
[null,"Applicants must provide a breakdown of depreciation and amortization expense in the above format for all relevant accounts.  Balances presented in the table should exclude asset retirement obligations (AROs) and the related depreciation and accretion expense. These should be disclosed separately consistent with the Notes of historical Audited Financial Statements."]
[]
[]
["Notes:"]
[1,"This is the net book value of assets that existed as at the date of the utility's change in depreciation policies (i.e. as at Jan. 1, 2012 or Jan. 1, 2013).  These assets are to be depreciated at the average remaining service life. This amount will not change in years subsequent to the date of the utility's change in depreciation policies.  This column is expected to be used until the assets that existed as at the date of the utility's change in depreciation policies are fully depreciated."]
[2,"This is the opening gross book value of assets that have been acquired after the date of the utilities change in depreciation policies (i.e. additions starting in 2012/2013 for those who changed policies Jan. 1, 2012/2013). These assets are to be depreciated at the revised service life. The amount is expected to be equal to the gross book value of the prior year plus the prior year's additions."]
[3,"A recalculation should be performed to determine the average remaining life of opening balance of assets (i.e. excluding current year's additions) under the change in policies under CGAAP.  For example, Asset A had a useful life of 20 years under CGAAP without the change in policies.  On January 1 of the year of policy changes, Asset A was 3 years depreciated. As a result, Asset A would have a remaining service life of 17 years (20 years less 3 years) as at January 1 of the year of policy changes.  Due to making the change in policies under CGAAP, management re-assessed the asset useful lives and concluded that the revised useful life of Asset A is now 30 years. Therefore, the average remaining useful life of the opening balance of Asset A is determined to be 27 years (30 years less 3 years) under the revised CGAAP as at January 1 of the year of policy changes."]
[4,"The useful life used should be consistent with the OEB's regulatory accounting policies as set out in the  Accounting Procedures Handbook for Electricity Distributors, effective Jan. 1, 2012 and also with the Report of the Board, Transition to International Financial Reporting Standards, EB-2008-0408, and the Kinectrics Report."]
[5,"Board policy of the \"half-year\" rule - the applicant must ensure that additions in the year attract a half-year depreciation expense in the first year.  Deviations from this standard practice must be supported in the application."]
[6,"The applicant must provide an explanation of material variances in evidence."]
[7,"This should include assets in column a (excel column C) that become fully depreciated since the date of the policy change.  The amount input in b (excel column D) should equal the net book value of the asset as at the date of depreciation policy change"]
[8,"This should include assets in column d (excel column f) that have become fully depreciated.  The amount input in e (excel column G) should equal the gross book value of the asset"]
[]
[]
[]
["Scenario that applies",null,"Applicable Years and Accounting Standard",null,null,null,null,null,null,null,null,null,null,null,null,null,null,"Year Reflected in Schedule Below","Accounting Standard Reflected in Schedule Below"]
["Rebasing for the first time with depreciation policy changes made in 2012.",null,"This appendix must be duplicated and completed for the years 2012 to 2018. The appendix for 2012 is to be completed under CGAAP (prior to changes in depreciation policies). The appendix for 2012 to 2014 must be completed under Revised CGAAP (after changes in depreciation policies). The appendix for 2014 to 2018 is to be completed under MIFRS (2014 if changes to MIFRS are material)."]
["Rebasing for the first time with depreciation policy changes made in 2013.",null,"This appendix must be duplicated and completed for the years 2013 to 2018. The appendix for 2013 is to be completed under CGAAP (prior to changes in depreciation policies). The appendix for 2013 to 2014 must be completed under Revised CGAAP (after changes in depreciation policies). The appendix for 2014 to 2018 is to be completed under MIFRS (2014 if changes to MIFRS are material).",null,null,null,null,null,null,null,null,null,null,null,null,null,null,2013,"Revised CGAAP"]
["Already rebased with depreciation policy changes in a prior rate application",null,"This appendix must be completed for 2014 to 2018. The appendix for 2014 is to be completed under Revised CGAAP (after changes in depreciation policies). The appendix for 2014 to 2018 is to be completed under MIFRS (2014 if changes to MIFRS are material)."]
[]
[]
[null,null,"Book Values",null,null,null,null,null,null,"Service Lives",null,null,null,"Depreciation Expense"]
["Account","Description","Opening Net  Book Value of Existing Assets as at Date of Policy Change (Jan. 1) 1","Less Fully Depreciated 7","Net Amount of Existing Assets Before Policy Change to be Depreciated ","Opening Gross Book Value of Assets Acquired After Policy Change 2","Less Fully Depreciated 8","Net Amount of Assets Acquired After Policy Change to be Depreciated ","Current Year Additions","Average Remaining Life of Assets Existing Before Policy Change 3","Depreciation Rate Assets Acquired After Policy Change","Life of Assets Acquired After Policy Change 4","Depreciation Rate on New Additions","Depreciation Expense on Assets Existing Before Policy Change","Depreciation Expense on Assets Acquired After Policy Change","Depreciation Expense on Current Year Additions 5","Total Current Year Depreciation Expense ","Depreciation Expense per Appendix 2-BA Fixed Assets, Column J \n ","Variance 6"]
[null,null,"a","b","c = a-b","d","e","f = d- e","g","h","i = 1/h","j","k = 1/j","l = c/h","m = f/j","n = g*0.5/j","o = l+m+n","p","q = p-o"]
[1611,"Computer Software (Formally known as Account 1925)",402592.5,null,{"$f":"C89-D89","v":402592.5},{"$f":"I89","v":54670.75},null,{"$f":"F89-G89","v":54670.75},{"$f":"'App.2-BA_Fixed Asset Cont'!E181","v":54670.75},{"$f":"(C89/'App.2-BA_Fixed Asset Cont'!D181)*L89","v":1.1126844595823613},{"$f":"IF(J89=0,0,1/J89)","v":0.89872738977170885},3,{"$f":"IF(L89=0,0,1/L89)","v":0.33333333333333331},{"$f":"IF(J89=0,0,+E89/J89)","v":361820.90666666668},{"$f":"IF(L89=0,0,+H89/L89)","v":18223.583333333332},{"$f":"IF(L89=0,0,+(I89*0.5)/L89)","v":9111.7916666666661},{"$f":"IF(ISERROR(+N89+O89+P89), 0, +N89+O89+P89)","v":389156.28166666668},{"$f":"-VLOOKUP(A89,'App.2-BA_Fixed Asset Cont'!$B$181:$M$219,11,)","v":737540.97},{"$f":"IF(ISERROR(+R89-122), 0, +R89-Q89)","v":348384.6883333333}]
[1612,"Land Rights (Formally known as Account 1906)",43879.040000000001,null,{"$f":"C90-D90","v":43879.040000000001},{"$f":"I90","v":947},null,{"$f":"F90-G90","v":947},{"$f":"'App.2-BA_Fixed Asset Cont'!E182","v":947},null,{"$f":"IF(J90=0,0,1/J90)","v":0},null,{"$f":"IF(L90=0,0,1/L90)","v":0},{"$f":"IF(J90=0,0,+E90/J90)","v":0},{"$f":"IF(L90=0,0,+H90/L90)","v":0},{"$f":"IF(L90=0,0,+(I90*0.5)/L90)","v":0},{"$f":"IF(ISERROR(+N90+O90+P90), 0, +N90+O90+P90)","v":0},{"$f":"-VLOOKUP(A90,'App.2-BA_Fixed Asset Cont'!$B$181:$M$219,11,)","v":0},{"$f":"IF(ISERROR(+R90-122), 0, +R90-Q90)","v":0}]
[1805,"Land",104039.08,null,104039.08,695,null,695,{"$f":"'App.2-BA_Fixed Asset Cont'!E183","v":695},null,0,null,0,0,{"$f":"IF(L91=0,0,+H91/L91)","v":0},0,0,{"$f":"-VLOOKUP(A91,'App.2-BA_Fixed Asset Cont'!$B$181:$M$219,11,)","v":0},0]
[1808,"Buildings",145794.17000000001,null,145794.17000000001,24917.26,null,24917.26,{"$f":"'App.2-BA_Fixed Asset Cont'!E184","v":24917.26},{"$f":"(C92/'App.2-BA_Fixed Asset Cont'!D184)*L92","v":44.642035709238897},2.2400412170116266E-2,60,1.6666666666666666E-2,3265.8495000000003,415.28766666666667,207.64383333333333,3888.7810000000004,{"$f":"-VLOOKUP(A92,'App.2-BA_Fixed Asset Cont'!$B$181:$M$219,11,)","v":75074.06},71185.278999999995]
[1810,"Leasehold Improvements",0,null,0,0,null,0,{"$f":"'App.2-BA_Fixed Asset Cont'!E185","v":0},null,0,null,0,0,0,0,0,{"$f":"-VLOOKUP(A93,'App.2-BA_Fixed Asset Cont'!$B$181:$M$219,11,)","v":0},0]
[1815,"Transformer Station Equipment >50 kV",0,null,0,0,null,0,{"$f":"'App.2-BA_Fixed Asset Cont'!E186","v":0},null,0,null,0,0,0,0,0,{"$f":"-VLOOKUP(A94,'App.2-BA_Fixed Asset Cont'!$B$181:$M$219,11,)","v":0},0]
[1820,"Distribution Station Equipment <50 kV",419329.29999999993,null,419329.29999999993,12875,null,12875,{"$f":"'App.2-BA_Fixed Asset Cont'!E187","v":12875},{"$f":"(C95/'App.2-BA_Fixed Asset Cont'!D187)*'App.2-C_DepExp'!L95","v":41.60778526855578},2.4033963681208699E-2,60,1.6666666666666666E-2,10078.145166666665,214.58333333333334,107.29166666666667,10400.020166666665,{"$f":"-VLOOKUP(A95,'App.2-BA_Fixed Asset Cont'!$B$181:$M$219,11,)","v":198234.41},187834.38983333335]
[1825,"Storage Battery Equipment",0,null,0,0,null,0,{"$f":"'App.2-BA_Fixed Asset Cont'!E188","v":0},null,0,null,0,0,0,0,0,{"$f":"-VLOOKUP(A96,'App.2-BA_Fixed Asset Cont'!$B$181:$M$219,11,)","v":0},0]
[1830,"Poles, Towers & Fixtures",3978437.6199999996,null,3978437.6199999996,471688.41,null,471688.41,{"$f":"'App.2-BA_Fixed Asset Cont'!E189","v":471688.41},{"$f":"C97/'App.2-BA_Fixed Asset Cont'!D189*'App.2-C_DepExp'!L97","v":32.870227514931699},3.0422667428929049E-2,50,0.02,121034.68459999999,9433.7681999999986,4716.8840999999993,135185.33689999999,{"$f":"-VLOOKUP(A97,'App.2-BA_Fixed Asset Cont'!$B$181:$M$219,11,)","v":2544985.02},2409799.6831]
[1835,"Overhead Conductors & Devices",4979931.2999999989,null,4979931.2999999989,700608.48,null,700608.48,{"$f":"'App.2-BA_Fixed Asset Cont'!E190","v":700608.48},{"$f":"C98/'App.2-BA_Fixed Asset Cont'!D190*'App.2-C_DepExp'!L98","v":26.408463199832688},3.7866648749418162E-2,60,1.6666666666666666E-2,188573.30933333331,11676.807999999999,5838.4039999999995,206088.52133333331,{"$f":"-VLOOKUP(A98,'App.2-BA_Fixed Asset Cont'!$B$181:$M$219,11,)","v":7035075.7400000002},6828987.2186666671]
[1840,"Underground Conduit",2362088.2999999998,null,2362088.2999999998,30269.8,null,30269.8,{"$f":"'App.2-BA_Fixed Asset Cont'!E191","v":30269.8},{"$f":"C99/'App.2-BA_Fixed Asset Cont'!D191*'App.2-C_DepExp'!L99","v":39.556070395815567},2.5280569833999105E-2,45,2.2222222222222223E-2,59714.938222222219,672.66222222222223,336.33111111111111,60723.931555555551,{"$f":"-VLOOKUP(A99,'App.2-BA_Fixed Asset Cont'!$B$181:$M$219,11,)","v":355353.72},294629.78844444442]
[1845,"Underground Conductors & Devices",5068257.6099999994,null,5068257.6099999994,344472.73,null,344472.73,{"$f":"'App.2-BA_Fixed Asset Cont'!E192","v":344472.73},{"$f":"C100/'App.2-BA_Fixed Asset Cont'!D192*'App.2-C_DepExp'!L100","v":40.169835839160697},2.4894301385845391E-2,45,2.2222222222222223E-2,126170.73244444444,7654.949555555555,3827.4747777777775,137653.15677777777,{"$f":"-VLOOKUP(A100,'App.2-BA_Fixed Asset Cont'!$B$181:$M$219,11,)","v":953898.08},816244.92322222213]
[1850,"Line Transformers",6507209.1899999995,null,6507209.1899999995,604927.6,null,604927.6,{"$f":"'App.2-BA_Fixed Asset Cont'!E193","v":604927.6},{"$f":"C101/'App.2-BA_Fixed Asset Cont'!D193*'App.2-C_DepExp'!L101","v":35.753554141089865},2.7969247366396714E-2,40,2.5000000000000001E-2,182001.74349999998,15123.189999999999,7561.5949999999993,204686.52849999999,{"$f":"-VLOOKUP(A101,'App.2-BA_Fixed Asset Cont'!$B$181:$M$219,11,)","v":1267670.1499999999},1062983.6214999999]
[1855,"Services (Overhead & Underground)",2725242.85,null,2725242.85,308079.99,null,308079.99,{"$f":"'App.2-BA_Fixed Asset Cont'!E194","v":308079.99},{"$f":"C102/'App.2-BA_Fixed Asset Cont'!D194*'App.2-C_DepExp'!L102","v":41.889828761928797},2.3872143418949499E-2,60,1.6666666666666666E-2,65057.388166666678,5134.6665000000003,2567.3332500000001,72759.387916666674,{"$f":"-VLOOKUP(A102,'App.2-BA_Fixed Asset Cont'!$B$181:$M$219,11,)","v":1486280.4300000002},1413521.0420833335]
[1860,"Meters",459051.75000000047,null,459051.75000000047,25248.52,null,25248.52,{"$f":"'App.2-BA_Fixed Asset Cont'!E195","v":25248.52},{"$f":"C103/'App.2-BA_Fixed Asset Cont'!D195*'App.2-C_DepExp'!L103","v":7.0310244467290328},0.14222678467079133,25,0.04,65289.45440000001,1009.9408,504.97039999999998,66804.365600000019,{"$f":"-VLOOKUP(A103,'App.2-BA_Fixed Asset Cont'!$B$181:$M$219,11,)","v":1198433.1299999999},1131628.7643999998]
[1860,"Meters (Smart Meters)",3099642.19,null,3099642.19,211907.02000000002,null,211907.02000000002,{"$f":"'App.2-BA_Fixed Asset Cont'!E196","v":211907.02000000002},{"$f":"C104/'App.2-BA_Fixed Asset Cont'!D196*'App.2-C_DepExp'!L104","v":12.880580832486796},7.7636250492512493E-2,12,8.3333333333333329E-2,240644.5975,17658.918333333335,8829.4591666666674,267132.97499999998,null,-267132.97499999998]
[1905,"Land",0,null,0,0,null,0,{"$f":"'App.2-BA_Fixed Asset Cont'!E197","v":0},null,0,null,0,0,0,0,0,{"$f":"-VLOOKUP(A105,'App.2-BA_Fixed Asset Cont'!$B$181:$M$219,11,)","v":0},0]
[1908,"Buildings & Fixtures",0,null,0,0,null,0,{"$f":"'App.2-BA_Fixed Asset Cont'!E198","v":0},null,0,null,0,0,0,0,0,{"$f":"-VLOOKUP(A106,'App.2-BA_Fixed Asset Cont'!$B$181:$M$219,11,)","v":0},0]
[1910,"Leasehold Improvements",223638.78,null,223638.78,53272.5,null,53272.5,{"$f":"'App.2-BA_Fixed Asset Cont'!E199","v":53272.5},{"$f":"C107/'App.2-BA_Fixed Asset Cont'!D199*'App.2-C_DepExp'!L107","v":65.615742678962604},1.5240245087107961E-2,55,1.8181818181818181E-2,3408.3098181818182,968.59090909090912,484.29545454545456,4861.1961818181826,{"$f":"-VLOOKUP(A107,'App.2-BA_Fixed Asset Cont'!$B$181:$M$219,11,)","v":17090.759999999998},12229.563818181816]
[1915,"Office Furniture & Equipment (10 years)",21131.350000000006,null,21131.350000000006,3059.23,null,3059.23,{"$f":"'App.2-BA_Fixed Asset Cont'!E200","v":3059.23},{"$f":"C108/'App.2-BA_Fixed Asset Cont'!D200*'App.2-C_DepExp'!L108","v":2.446789774901617},0.40869878166799556,10,0.1,8636.357,305.923,152.9615,9095.2415000000001,{"$f":"-VLOOKUP(A108,'App.2-BA_Fixed Asset Cont'!$B$181:$M$219,11,)","v":68291.45},59196.208499999993]
[1915,"Office Furniture & Equipment (5 years)",0,null,0,0,null,0,{"$f":"'App.2-BA_Fixed Asset Cont'!E201","v":0},null,0,null,0,0,0,0,0,null,0]
[1920,"Computer Equipment - Hardware",0,null,0,0,null,0,{"$f":"'App.2-BA_Fixed Asset Cont'!E202","v":0},{"$f":"(C110/'App.2-BA_Fixed Asset Cont'!D194)*'Appendix 2-BB Service Life  '!N175","v":0},0,null,0,0,0,0,0,{"$f":"-'App.2-BA_Fixed Asset Cont'!L202","v":97941},97941]
[1920,"Computer Equip.-Hardware(Post Mar. 22/04)",0,null,0,0,null,0,{"$f":"'App.2-BA_Fixed Asset Cont'!E203","v":0},{"$f":"(C111/'App.2-BA_Fixed Asset Cont'!D195)*'Appendix 2-BB Service Life  '!N176","v":0},0,null,0,0,0,0,0,{"$f":"-'App.2-BA_Fixed Asset Cont'!L203","v":3892},3892]
[1920,"Computer Equip.-Hardware(Post Mar. 19/07)",83695.75,null,83695.75,57213.91,null,57213.91,{"$f":"'App.2-BA_Fixed Asset Cont'!E204","v":57213.91},{"$f":"C112/'App.2-BA_Fixed Asset Cont'!D204*'App.2-C_DepExp'!L112","v":9.1122210125204148},0.10974272887213507,5,0.2,9184.9999999999982,11442.782000000001,5721.3910000000005,26349.172999999999,{"$f":"-'App.2-BA_Fixed Asset Cont'!L204","v":19443.16},-6906.012999999999]
[1930,"Transportation Equipment",1051728.2000000009,null,1051728.2000000009,386631.99,null,386631.99,{"$f":"'App.2-BA_Fixed Asset Cont'!E205","v":386631.99},{"$f":"C113/'App.2-BA_Fixed Asset Cont'!D205*'App.2-C_DepExp'!L113","v":3.1490898672164405},0.31755206811037284,8,0.125,333978.46500000008,48328.998749999999,24164.499374999999,406471.96312500013,{"$f":"-VLOOKUP(A113,'App.2-BA_Fixed Asset Cont'!$B$181:$M$219,11,)","v":1960131.51},1553659.546875]
[1935,"Stores Equipment",0,null,0,0,null,0,{"$f":"'App.2-BA_Fixed Asset Cont'!E206","v":0},null,0,null,0,0,0,0,0,{"$f":"-VLOOKUP(A114,'App.2-BA_Fixed Asset Cont'!$B$181:$M$219,11,)","v":0},0]
[1940,"Tools, Shop & Garage Equipment",74551.109999999986,null,74551.109999999986,16441.830000000002,null,16441.830000000002,{"$f":"'App.2-BA_Fixed Asset Cont'!E207","v":16441.830000000002},{"$f":"C115/'App.2-BA_Fixed Asset Cont'!D207*'App.2-C_DepExp'!L115","v":4.2407356096292323},0.23580814557958968,10,0.1,17579.759000000002,1644.1830000000002,822.09150000000011,20046.033500000001,{"$f":"-VLOOKUP(A115,'App.2-BA_Fixed Asset Cont'!$B$181:$M$219,11,)","v":117688.31},97642.276499999993]
[1945,"Measurement & Testing Equipment",9193.1400000000012,null,9193.1400000000012,0,null,0,{"$f":"'App.2-BA_Fixed Asset Cont'!E208","v":0},{"$f":"C116/'App.2-BA_Fixed Asset Cont'!D208*'App.2-C_DepExp'!L116","v":5.0853623120261764},0.19664282280047948,8,0.125,1807.7650000000001,0,0,1807.7650000000001,{"$f":"-VLOOKUP(A116,'App.2-BA_Fixed Asset Cont'!$B$181:$M$219,11,)","v":5268.98},3461.2149999999992]
[1950,"Power Operated Equipment",43881.82,null,43881.82,0,null,0,{"$f":"'App.2-BA_Fixed Asset Cont'!E209","v":0},{"$f":"C117/'App.2-BA_Fixed Asset Cont'!D209*'App.2-C_DepExp'!L117","v":5.4774734516450154},0.18256592365585564,8,0.125,8011.3249999999998,0,0,8011.3249999999998,{"$f":"-VLOOKUP(A117,'App.2-BA_Fixed Asset Cont'!$B$181:$M$219,11,)","v":20208.78},12197.454999999998]
[1955,"Communications Equipment",0,null,0,0,null,0,{"$f":"'App.2-BA_Fixed Asset Cont'!E210","v":0},null,0,null,0,0,0,0,0,{"$f":"-VLOOKUP(A118,'App.2-BA_Fixed Asset Cont'!$B$181:$M$219,11,)","v":0},0]
[1955,"Communication Equipment (Smart Meters)",0,null,0,0,null,0,{"$f":"'App.2-BA_Fixed Asset Cont'!E211","v":0},null,0,null,0,0,0,0,0,{"$f":"-VLOOKUP(A119,'App.2-BA_Fixed Asset Cont'!$B$181:$M$219,11,)","v":0},0]
[1960,"Miscellaneous Equipment ",0,null,0,0,null,0,{"$f":"'App.2-BA_Fixed Asset Cont'!E212","v":0},null,0,null,0,0,0,0,0,{"$f":"-VLOOKUP(A120,'App.2-BA_Fixed Asset Cont'!$B$181:$M$219,11,)","v":0},0]
[1970,"Load Management Controls Customer Premises",0,null,0,0,null,0,{"$f":"'App.2-BA_Fixed Asset Cont'!E213","v":0},null,0,null,0,0,0,0,0,{"$f":"-VLOOKUP(A121,'App.2-BA_Fixed Asset Cont'!$B$181:$M$219,11,)","v":0},0]
[1975,"Load Management Controls Utility Premises",0,null,0,0,null,0,{"$f":"'App.2-BA_Fixed Asset Cont'!E214","v":0},null,0,null,0,0,0,0,0,{"$f":"-VLOOKUP(A122,'App.2-BA_Fixed Asset Cont'!$B$181:$M$219,11,)","v":0},0]
[1980,"System Supervisor Equipment",198467.89,null,198467.89,42215.85,null,42215.85,{"$f":"'App.2-BA_Fixed Asset Cont'!E215","v":42215.85},{"$f":"C123/'App.2-BA_Fixed Asset Cont'!D215*'App.2-C_DepExp'!L123","v":4.6378633138658003},0.21561653121822374,5,0.2,42792.957999999999,8443.17,4221.585,55457.712999999996,{"$f":"-VLOOKUP(A123,'App.2-BA_Fixed Asset Cont'!$B$181:$M$219,11,)","v":57712.75},2255.0370000000039]
[1985,"Miscellaneous Fixed Assets",0,null,0,0,null,0,{"$f":"'App.2-BA_Fixed Asset Cont'!E216","v":0},null,0,null,0,0,0,0,0,{"$f":"-VLOOKUP(A124,'App.2-BA_Fixed Asset Cont'!$B$181:$M$219,11,)","v":0},0]
[1990,"Other Tangible Property",0,null,0,0,null,0,{"$f":"'App.2-BA_Fixed Asset Cont'!E217","v":0},null,0,null,0,0,0,0,0,{"$f":"-VLOOKUP(A125,'App.2-BA_Fixed Asset Cont'!$B$181:$M$219,11,)","v":0},0]
[1995,"Contributions & Grants",-5819423.9699999997,null,-5819423.9699999997,-1446296.2299999995,null,-1446296.2299999995,{"$f":"'App.2-BA_Fixed Asset Cont'!E218","v":-1446296.2299999995},{"$f":"C126/'App.2-BA_Fixed Asset Cont'!D218*'App.2-C_DepExp'!L126","v":27.223397230282742},3.6733108345773272E-2,25,0.04,-213765.53120000003,-57851.849199999982,-28925.924599999991,-300543.30499999999,{"$f":"-VLOOKUP(A126,'App.2-BA_Fixed Asset Cont'!$B$181:$M$219,11,)","v":-971010.54},-670467.2350000001]
[null,"Total",{"$f":"SUM(C89:C126)","v":26182358.970000006},0,26182358.970000006,1903846.6400000001,0,1903846.6400000001,1903846.6400000001,null,null,null,null,{"$f":"SUM(N89:N126)","v":1635286.1571181819},100500.15640353538,50250.07820176769,1786036.391723485,17249203.870000001,15463167.478276515]
[]
[]
["General:","Applicants are to complete this appendix to show the reasonability of the depreciation expense that is included in rate base via. Accumulated depreciation and the revenue requirement."]
[null,"Applicants must provide a breakdown of depreciation and amortization expense in the above format for all relevant accounts.  Balances presented in the table should exclude asset retirement obligations (AROs) and the related depreciation and accretion expense. These should be disclosed separately consistent with the Notes of historical Audited Financial Statements."]
[]
[]
["Notes:"]
[1,"This is the net book value of assets that existed as at the date of the utility's change in depreciation policies (i.e. as at Jan. 1, 2012 or Jan. 1, 2013).  These assets are to be depreciated at the average remaining service life. This amount will not change in years subsequent to the date of the utility's change in depreciation policies.  This column is expected to be used until the assets that existed as at the date of the utility's change in depreciation policies are fully depreciated."]
[2,"This is the opening gross book value of assets that have been acquired after the date of the utilities change in depreciation policies (i.e. additions starting in 2012/2013 for those who changed policies Jan. 1, 2012/2013). These assets are to be depreciated at the revised service life. The amount is expected to be equal to the gross book value of the prior year plus the prior year's additions."]
[3,"A recalculation should be performed to determine the average remaining life of opening balance of assets (i.e. excluding current year's additions) under the change in policies under CGAAP.  For example, Asset A had a useful life of 20 years under CGAAP without the change in policies.  On January 1 of the year of policy changes, Asset A was 3 years depreciated. As a result, Asset A would have a remaining service life of 17 years (20 years less 3 years) as at January 1 of the year of policy changes.  Due to making the change in policies under CGAAP, management re-assessed the asset useful lives and concluded that the revised useful life of Asset A is now 30 years. Therefore, the average remaining useful life of the opening balance of Asset A is determined to be 27 years (30 years less 3 years) under the revised CGAAP as at January 1 of the year of policy changes."]
[4,"The useful life used should be consistent with the OEB's regulatory accounting policies as set out in the  Accounting Procedures Handbook for Electricity Distributors, effective Jan. 1, 2012 and also with the Report of the Board, Transition to International Financial Reporting Standards, EB-2008-0408, and the Kinectrics Report."]
[5,"Board policy of the \"half-year\" rule - the applicant must ensure that additions in the year attract a half-year depreciation expense in the first year.  Deviations from this standard practice must be supported in the application."]
[6,"The applicant must provide an explanation of material variances in evidence."]
[7,"This should include assets in column a (excel column C) that become fully depreciated since the date of the policy change.  The amount input in b (excel column D) should equal the net book value of the asset as at the date of depreciation policy change"]
[8,"This should include assets in column d (excel column f) that have become fully depreciated.  The amount input in e (excel column G) should equal the gross book value of the asset"]
[]
[]
[]
[]
["Scenario that applies",null,"Applicable Years and Accounting Standard",null,null,null,null,null,null,null,null,null,null,null,null,null,null,"Year Reflected in Schedule Below","Accounting Standard Reflected in Schedule Below"]
["Rebasing for the first time with depreciation policy changes made in 2012.",null,"This appendix must be duplicated and completed for the years 2012 to 2018. The appendix for 2012 is to be completed under CGAAP (prior to changes in depreciation policies). The appendix for 2012 to 2014 must be completed under Revised CGAAP (after changes in depreciation policies). The appendix for 2014 to 2018 is to be completed under MIFRS (2014 if changes to MIFRS are material)."]
["Rebasing for the first time with depreciation policy changes made in 2013.",null,"This appendix must be duplicated and completed for the years 2013 to 2018. The appendix for 2013 is to be completed under CGAAP (prior to changes in depreciation policies). The appendix for 2013 to 2014 must be completed under Revised CGAAP (after changes in depreciation policies). The appendix for 2014 to 2018 is to be completed under MIFRS (2014 if changes to MIFRS are material).",null,null,null,null,null,null,null,null,null,null,null,null,null,null,2014,"Revised CGAAP"]
["Already rebased with depreciation policy changes in a prior rate application",null,"This appendix must be completed for 2014 to 2018. The appendix for 2014 is to be completed under Revised CGAAP (after changes in depreciation policies). The appendix for 2014 to 2018 is to be completed under MIFRS (2014 if changes to MIFRS are material)."]
[]
[]
[null,null,"Book Values",null,null,null,null,null,null,"Service Lives",null,null,null,"Depreciation Expense"]
["Account","Description","Opening Net  Book Value of Existing Assets as at Date of Policy Change (Jan. 1) 1","Less Fully Depreciated 7","Net Amount of Existing Assets Before Policy Change to be Depreciated ","Opening Gross Book Value of Assets Acquired After Policy Change 2","Less Fully Depreciated 8","Net Amount of Assets Acquired After Policy Change to be Depreciated ","Current Year Additions","Average Remaining Life of Assets Existing Before Policy Change 3","Depreciation Rate Assets Acquired After Policy Change","Life of Assets Acquired After Policy Change 4","Depreciation Rate on New Additions","Depreciation Expense on Assets Existing Before Policy Change","Depreciation Expense on Assets Acquired After Policy Change","Depreciation Expense on Current Year Additions 5","Total Current Year Depreciation Expense ","Depreciation Expense per Appendix 2-BA Fixed Assets, Column J \n ","Variance 6"]
[null,null,"a","b","c = a-b","d","e","f = d- e","g","h","i = 1/h","j","k = 1/j","l = c/h","m = f/j","n = g*0.5/j","o = l+m+n","p","q = p-o"]
[1611,"Computer Software (Formally known as Account 1925)",{"$f":"'App.2-BA_Fixed Asset Cont'!M107","v":402592.5},null,{"$f":"C156-D156","v":402592.5},{"$f":"I156","v":87557.439999999944},null,{"$f":"F156-G156","v":87557.439999999944},{"$f":"'App.2-BA_Fixed Asset Cont'!E253","v":87557.439999999944},{"$f":"(C156/'App.2-BA_Fixed Asset Cont'!D253)*L156","v":1.0593299221362216},{"$f":"IF(J156=0,0,1/J156)","v":0.94399297055956077},3,{"$f":"IF(L156=0,0,1/L156)","v":0.33333333333333331},{"$f":"IF(J156=0,0,+E156/J156)","v":380044.49},{"$f":"IF(L156=0,0,+H156/L156)","v":29185.813333333313},{"$f":"IF(L156=0,0,+(I156*0.5)/L156)","v":14592.906666666657},{"$f":"IF(ISERROR(+N156+O156+P156), 0, +N156+O156+P156)","v":423823.20999999996},{"$f":"-VLOOKUP(A156,'App.2-BA_Fixed Asset Cont'!$B$253:$M$292,11,)","v":817283.30999999994},{"$f":"IF(ISERROR(+R156-122), 0, +R156-Q156)","v":393460.1}]
[1612,"Land Rights (Formally known as Account 1906)",{"$f":"'App.2-BA_Fixed Asset Cont'!M108","v":43879.040000000001},null,{"$f":"C157-D157","v":43879.040000000001},{"$f":"I157","v":0},null,{"$f":"F157-G157","v":0},{"$f":"'App.2-BA_Fixed Asset Cont'!E254","v":0},null,{"$f":"IF(J157=0,0,1/J157)","v":0},null,{"$f":"IF(L157=0,0,1/L157)","v":0},{"$f":"IF(J157=0,0,+E157/J157)","v":0},{"$f":"IF(L157=0,0,+H157/L157)","v":0},{"$f":"IF(L157=0,0,+(I157*0.5)/L157)","v":0},{"$f":"IF(ISERROR(+N157+O157+P157), 0, +N157+O157+P157)","v":0},{"$f":"-VLOOKUP(A157,'App.2-BA_Fixed Asset Cont'!$B$253:$M$292,11,)","v":0},{"$f":"IF(ISERROR(+R157-122), 0, +R157-Q157)","v":0}]
[1805,"Land",{"$f":"'App.2-BA_Fixed Asset Cont'!M109","v":104039.08},null,104039.08,0,null,0,{"$f":"'App.2-BA_Fixed Asset Cont'!E255","v":0},null,0,null,0,0,{"$f":"IF(L158=0,0,+H158/L158)","v":0},0,0,{"$f":"-VLOOKUP(A158,'App.2-BA_Fixed Asset Cont'!$B$253:$M$292,11,)","v":0},0]
[1808,"Buildings",{"$f":"'App.2-BA_Fixed Asset Cont'!M110","v":145794.17000000001},null,145794.17000000001,4014,null,4014,{"$f":"'App.2-BA_Fixed Asset Cont'!E256","v":4014},{"$f":"(C159/'App.2-BA_Fixed Asset Cont'!D256)*L159","v":39.605742301642934},2.5248863974922084E-2,60,1.6666666666666666E-2,3681.1371666666664,66.900000000000006,33.450000000000003,3781.4871666666663,{"$f":"-VLOOKUP(A159,'App.2-BA_Fixed Asset Cont'!$B$253:$M$292,11,)","v":83989.069999999992},80207.582833333319]
[1810,"Leasehold Improvements",{"$f":"'App.2-BA_Fixed Asset Cont'!M111","v":0},null,0,0,null,0,{"$f":"'App.2-BA_Fixed Asset Cont'!E257","v":0},null,0,null,0,0,0,0,0,{"$f":"-VLOOKUP(A160,'App.2-BA_Fixed Asset Cont'!$B$253:$M$292,11,)","v":0},0]
[1815,"Transformer Station Equipment >50 kV",{"$f":"'App.2-BA_Fixed Asset Cont'!M112","v":0},null,0,0,null,0,{"$f":"'App.2-BA_Fixed Asset Cont'!E258","v":0},null,0,null,0,0,0,0,0,{"$f":"-VLOOKUP(A161,'App.2-BA_Fixed Asset Cont'!$B$253:$M$292,11,)","v":0},0]
[1820,"Distribution Station Equipment <50 kV",{"$f":"'App.2-BA_Fixed Asset Cont'!M113","v":423044.88709565229},null,423044.88709565229,3664.9073003279773,null,3664.9073003279773,{"$f":"'App.2-BA_Fixed Asset Cont'!E259","v":3664.9073003279773},{"$f":"(C162/'App.2-BA_Fixed Asset Cont'!D259)*'App.2-C_DepExp'!L162","v":41.101335481223693},2.4330109673853045E-2,60,1.6666666666666666E-2,10292.728499999999,61.081788338799619,30.540894169399809,10384.351182508199,{"$f":"-VLOOKUP(A162,'App.2-BA_Fixed Asset Cont'!$B$253:$M$292,11,)","v":222936.95999999999},212552.6088174918]
[1825,"Storage Battery Equipment",{"$f":"'App.2-BA_Fixed Asset Cont'!M114","v":0},null,0,0,null,0,{"$f":"'App.2-BA_Fixed Asset Cont'!E260","v":0},null,0,null,0,0,0,0,0,{"$f":"-VLOOKUP(A163,'App.2-BA_Fixed Asset Cont'!$B$253:$M$292,11,)","v":0},0]
[1830,"Poles, Towers & Fixtures",{"$f":"'App.2-BA_Fixed Asset Cont'!M115","v":4015623.2747665741},null,4015623.2747665741,1270813.2524724056,null,1270813.2524724056,{"$f":"'App.2-BA_Fixed Asset Cont'!E261","v":1270813.2524724056},{"$f":"C164/'App.2-BA_Fixed Asset Cont'!D261*'App.2-C_DepExp'!L164","v":30.778500002006421},3.2490212321419527E-2,50,0.02,130468.45279999998,25416.265049448109,12708.132524724055,168592.85037417215,{"$f":"-VLOOKUP(A164,'App.2-BA_Fixed Asset Cont'!$B$253:$M$292,11,)","v":2788948.0700000003},2620355.2196258283]
[1835,"Overhead Conductors & Devices",{"$f":"'App.2-BA_Fixed Asset Cont'!M116","v":5049454.0686400868},null,5049454.0686400868,1410234.9119059034,null,1410234.9119059034,{"$f":"'App.2-BA_Fixed Asset Cont'!E262","v":1410234.9119059034},{"$f":"C165/'App.2-BA_Fixed Asset Cont'!D262*'App.2-C_DepExp'!L165","v":25.215735880118572},3.9657775793426407E-2,60,1.6666666666666666E-2,200250.1173333333,23503.915198431721,11751.957599215861,235505.99013098088,{"$f":"-VLOOKUP(A165,'App.2-BA_Fixed Asset Cont'!$B$253:$M$292,11,)","v":7540555.3899999997},7305049.3998690192]
[1840,"Underground Conduit",{"$f":"'App.2-BA_Fixed Asset Cont'!M117","v":2378599.973294558},null,2378599.973294558,61798.831699930488,null,61798.831699930488,{"$f":"'App.2-BA_Fixed Asset Cont'!E263","v":61798.831699930488},{"$f":"C166/'App.2-BA_Fixed Asset Cont'!D263*'App.2-C_DepExp'!L166","v":39.388880428902439},2.5387875692608631E-2,45,2.2222222222222223E-2,60387.600444444441,1373.3073711095665,686.65368555478324,62447.561501108787,{"$f":"-VLOOKUP(A166,'App.2-BA_Fixed Asset Cont'!$B$253:$M$292,11,)","v":464964.85},402517.28849889117]
[1845,"Underground Conductors & Devices",{"$f":"'App.2-BA_Fixed Asset Cont'!M118","v":5103144.8589108996},null,5103144.8589108996,734038.68367366423,null,734038.68367366423,{"$f":"'App.2-BA_Fixed Asset Cont'!E264","v":734038.68367366423},{"$f":"C167/'App.2-BA_Fixed Asset Cont'!D264*'App.2-C_DepExp'!L167","v":38.132776778308518},2.6224158964705684E-2,45,2.2222222222222223E-2,133825.68199999997,16311.970748303649,8155.9853741518245,158293.63812245545,{"$f":"-VLOOKUP(A167,'App.2-BA_Fixed Asset Cont'!$B$253:$M$292,11,)","v":1207628.4999999998},1049334.8618775443]
[1850,"Line Transformers",{"$f":"'App.2-BA_Fixed Asset Cont'!M119","v":6551942.5093659144},null,6551942.5093659144,598730.32253643672,null,598730.32253643672,{"$f":"'App.2-BA_Fixed Asset Cont'!E265","v":598730.32253643672},{"$f":"C168/'App.2-BA_Fixed Asset Cont'!D265*'App.2-C_DepExp'!L168","v":33.70826593106159},2.9666313955311392E-2,40,2.5000000000000001E-2,194371.98349999997,14968.258063410918,7484.1290317054591,216824.37059511637,{"$f":"-VLOOKUP(A168,'App.2-BA_Fixed Asset Cont'!$B$253:$M$292,11,)","v":1520711.18},1303886.8094048835]
[1855,"Services (Overhead & Underground)",{"$f":"'App.2-BA_Fixed Asset Cont'!M120","v":2749228.0563997268},null,2749228.0563997268,548804.4075754697,null,548804.4075754697,{"$f":"'App.2-BA_Fixed Asset Cont'!E266","v":548804.4075754697},{"$f":"C169/'App.2-BA_Fixed Asset Cont'!D266*'App.2-C_DepExp'!L169","v":39.167225827131986},2.553155039403578E-2,60,1.6666666666666666E-2,70192.054666666663,9146.7401262578278,4573.3700631289139,83912.164856053394,{"$f":"-VLOOKUP(A169,'App.2-BA_Fixed Asset Cont'!$B$253:$M$292,11,)","v":1665217.58},1581305.4151439467]
[1860,"Meters",{"$f":"'App.2-BA_Fixed Asset Cont'!M121","v":469081.23501596926},null,469081.23501596926,0,null,0,{"$f":"'App.2-BA_Fixed Asset Cont'!E267","v":0},null,0,25,0.04,0,0,0,0,{"$f":"-VLOOKUP(A170,'App.2-BA_Fixed Asset Cont'!$B$253:$M$292,11,)","v":0},0]
[1860,"Meters (Smart Meters)",{"$f":"'App.2-BA_Fixed Asset Cont'!M122","v":3117386.2479853281},null,3117386.2479853281,162463.44158962549,null,162463.44158962549,{"$f":"'App.2-BA_Fixed Asset Cont'!E268","v":162463.44158962549},{"$f":"C171/'App.2-BA_Fixed Asset Cont'!D268*'App.2-C_DepExp'!L171","v":7.8637031185765522},0.12716655053236736,12,8.3333333333333329E-2,396427.25583333336,13538.620132468792,6769.3100662343959,416735.18603203655,{"$f":"-'App.2-BA_Fixed Asset Cont'!L268","v":1508385.2199999997},1091650.0339679632]
[1905,"Land",{"$f":"'App.2-BA_Fixed Asset Cont'!M123","v":0},null,0,0,null,0,{"$f":"'App.2-BA_Fixed Asset Cont'!E269","v":0},null,0,null,0,0,0,0,0,{"$f":"-VLOOKUP(A172,'App.2-BA_Fixed Asset Cont'!$B$253:$M$292,11,)","v":0},0]
[1908,"Buildings & Fixtures",{"$f":"'App.2-BA_Fixed Asset Cont'!M124","v":0},null,0,0,null,0,{"$f":"'App.2-BA_Fixed Asset Cont'!E270","v":0},null,0,null,0,0,0,0,0,{"$f":"-VLOOKUP(A173,'App.2-BA_Fixed Asset Cont'!$B$253:$M$292,11,)","v":0},0]
[1910,"Leasehold Improvements",{"$f":"'App.2-BA_Fixed Asset Cont'!M125","v":223638.78},null,223638.78,47056.26999999999,null,47056.26999999999,{"$f":"'App.2-BA_Fixed Asset Cont'!E271","v":47056.26999999999},{"$f":"C174/'App.2-BA_Fixed Asset Cont'!D271*'App.2-C_DepExp'!L174","v":51.095237003319156},1.9571295851608238E-2,55,1.8181818181818181E-2,4376.9007272727276,855.5685454545453,427.78427272727265,5660.2535454545459,{"$f":"-VLOOKUP(A174,'App.2-BA_Fixed Asset Cont'!$B$253:$M$292,11,)","v":27661.07},22000.816454545453]
[1915,"Office Furniture & Equipment (10 years)",{"$f":"'App.2-BA_Fixed Asset Cont'!M126","v":21131.350000000006},null,21131.350000000006,2395,null,2395,{"$f":"'App.2-BA_Fixed Asset Cont'!E272","v":2395},{"$f":"C175/'App.2-BA_Fixed Asset Cont'!D272*'App.2-C_DepExp'!L175","v":2.3630830168592358},0.42317599206865614,10,0.1,8942.2799999999988,239.5,119.75,9301.5299999999988,{"$f":"-VLOOKUP(A175,'App.2-BA_Fixed Asset Cont'!$B$253:$M$292,11,)","v":72339.41},63037.880000000005]
[1915,"Office Furniture & Equipment (5 years)",{"$f":"'App.2-BA_Fixed Asset Cont'!M127","v":0},null,0,0,null,0,{"$f":"'App.2-BA_Fixed Asset Cont'!E273","v":0},null,0,null,0,0,0,0,0,null,0]
[1920,"Computer Equipment - Hardware",{"$f":"'App.2-BA_Fixed Asset Cont'!M128","v":0},null,0,0,null,0,{"$f":"'App.2-BA_Fixed Asset Cont'!E274","v":0},null,0,null,0,0,0,0,0,{"$f":"-'App.2-BA_Fixed Asset Cont'!L274","v":97941},97941]
[1920,"Computer Equip.-Hardware(Post Mar. 22/04)",{"$f":"'App.2-BA_Fixed Asset Cont'!M129","v":0},null,0,0,null,0,{"$f":"'App.2-BA_Fixed Asset Cont'!E275","v":0},null,0,null,0,0,0,0,0,{"$f":"-'App.2-BA_Fixed Asset Cont'!L275","v":3892},3892]
[1920,"Computer Equip.-Hardware(Post Mar. 19/07)",{"$f":"'App.2-BA_Fixed Asset Cont'!M130","v":83695.75},null,83695.75,34018.25,null,34018.25,{"$f":"'App.2-BA_Fixed Asset Cont'!E276","v":34018.25},{"$f":"C179/'App.2-BA_Fixed Asset Cont'!D276*'App.2-C_DepExp'!L179","v":4.0574284719510798},0.24646152283718112,5,0.2,20627.782000000003,6803.65,3401.8249999999998,30833.257000000001,{"$f":"-'App.2-BA_Fixed Asset Cont'!L276","v":43472.619999999995},12639.362999999994]
[1930,"Transportation Equipment",{"$f":"'App.2-BA_Fixed Asset Cont'!M131","v":1051728.2000000009},{"$f":"2030.12+21295.81","v":23325.93},1028402.2700000008,137333.99999999991,null,137333.99999999991,{"$f":"'App.2-BA_Fixed Asset Cont'!E277","v":137333.99999999991},{"$f":"C180/'App.2-BA_Fixed Asset Cont'!D277*'App.2-C_DepExp'!L180","v":2.793564910100014},0.35796555017731752,8,0.125,368132.58438415249,17166.749999999989,8583.3749999999945,393882.70938415249,{"$f":"-VLOOKUP(A180,'App.2-BA_Fixed Asset Cont'!$B$253:$M$292,11,)","v":2168467.33},1774584.6206158476]
[1935,"Stores Equipment",{"$f":"'App.2-BA_Fixed Asset Cont'!M132","v":0},null,0,0,null,0,{"$f":"'App.2-BA_Fixed Asset Cont'!E278","v":0},null,0,null,0,0,0,0,0,{"$f":"-VLOOKUP(A181,'App.2-BA_Fixed Asset Cont'!$B$253:$M$292,11,)","v":0},0]
[1940,"Tools, Shop & Garage Equipment",{"$f":"'App.2-BA_Fixed Asset Cont'!M133","v":74551.109999999986},null,74551.109999999986,23803.409999999974,null,23803.409999999974,{"$f":"'App.2-BA_Fixed Asset Cont'!E279","v":23803.409999999974},{"$f":"C182/'App.2-BA_Fixed Asset Cont'!D279*'App.2-C_DepExp'!L182","v":3.8780344842904748},0.25786258581528831,10,0.1,19223.941999999995,2380.3409999999976,1190.1704999999988,22794.453499999992,{"$f":"-VLOOKUP(A182,'App.2-BA_Fixed Asset Cont'!$B$253:$M$292,11,)","v":137163.51999999999},114369.0665]
[1945,"Measurement & Testing Equipment",{"$f":"'App.2-BA_Fixed Asset Cont'!M134","v":9193.1400000000012},null,9193.1400000000012,0,null,0,{"$f":"'App.2-BA_Fixed Asset Cont'!E280","v":0},{"$f":"C183/'App.2-BA_Fixed Asset Cont'!D280*'App.2-C_DepExp'!L183","v":5.0853623120261764},0.19664282280047948,8,0.125,1807.7650000000001,0,0,1807.7650000000001,{"$f":"-VLOOKUP(A183,'App.2-BA_Fixed Asset Cont'!$B$253:$M$292,11,)","v":6715.19},4907.4249999999993]
[1950,"Power Operated Equipment",{"$f":"'App.2-BA_Fixed Asset Cont'!M135","v":43881.82},null,43881.82,0,null,0,{"$f":"'App.2-BA_Fixed Asset Cont'!E281","v":0},{"$f":"C184/'App.2-BA_Fixed Asset Cont'!D281*'App.2-C_DepExp'!L184","v":5.4774734516450154},0.18256592365585564,8,0.125,8011.3249999999998,0,0,8011.3249999999998,{"$f":"-VLOOKUP(A184,'App.2-BA_Fixed Asset Cont'!$B$253:$M$292,11,)","v":26617.84},18606.514999999999]
[1955,"Communications Equipment",{"$f":"'App.2-BA_Fixed Asset Cont'!M136","v":0},null,0,0,null,0,{"$f":"'App.2-BA_Fixed Asset Cont'!E282","v":0},null,0,null,0,0,0,0,0,{"$f":"-VLOOKUP(A185,'App.2-BA_Fixed Asset Cont'!$B$253:$M$292,11,)","v":0},0]
[1955,"Communication Equipment (Smart Meters)",{"$f":"'App.2-BA_Fixed Asset Cont'!M137","v":0},null,0,0,null,0,{"$f":"'App.2-BA_Fixed Asset Cont'!E283","v":0},null,0,null,0,0,0,0,0,{"$f":"-VLOOKUP(A186,'App.2-BA_Fixed Asset Cont'!$B$253:$M$292,11,)","v":0},0]
[1960,"Miscellaneous Equipment ",{"$f":"'App.2-BA_Fixed Asset Cont'!M138","v":0},null,0,0,null,0,{"$f":"'App.2-BA_Fixed Asset Cont'!E284","v":0},null,0,null,0,0,0,0,0,{"$f":"-VLOOKUP(A187,'App.2-BA_Fixed Asset Cont'!$B$253:$M$292,11,)","v":0},0]
[1970,"Load Management Controls Customer Premises",{"$f":"'App.2-BA_Fixed Asset Cont'!M139","v":0},null,0,0,null,0,{"$f":"'App.2-BA_Fixed Asset Cont'!E285","v":0},null,0,null,0,0,0,0,0,{"$f":"-VLOOKUP(A188,'App.2-BA_Fixed Asset Cont'!$B$253:$M$292,11,)","v":0},0]
[1975,"Load Management Controls Utility Premises",{"$f":"'App.2-BA_Fixed Asset Cont'!M140","v":0},null,0,0,null,0,{"$f":"'App.2-BA_Fixed Asset Cont'!E286","v":0},null,0,null,0,0,0,0,0,{"$f":"-VLOOKUP(A189,'App.2-BA_Fixed Asset Cont'!$B$253:$M$292,11,)","v":0},0]
[1980,"System Supervisor Equipment",{"$f":"'App.2-BA_Fixed Asset Cont'!M141","v":198467.89},null,198467.89,3856.3099999999977,null,3856.3099999999977,{"$f":"'App.2-BA_Fixed Asset Cont'!E287","v":3856.3099999999977},{"$f":"C190/'App.2-BA_Fixed Asset Cont'!D287*'App.2-C_DepExp'!L190","v":3.8735926727328032},0.25815827436871525,5,0.2,51236.127999999997,771.26199999999949,385.63099999999974,52393.021000000001,{"$f":"-VLOOKUP(A190,'App.2-BA_Fixed Asset Cont'!$B$253:$M$292,11,)","v":83330.81},30937.788999999997]
[1985,"Miscellaneous Fixed Assets",{"$f":"'App.2-BA_Fixed Asset Cont'!M142","v":0},null,0,0,null,0,{"$f":"'App.2-BA_Fixed Asset Cont'!E288","v":0},null,0,null,0,0,0,0,0,{"$f":"-VLOOKUP(A191,'App.2-BA_Fixed Asset Cont'!$B$253:$M$292,11,)","v":0},0]
[1990,"Other Tangible Property",{"$f":"'App.2-BA_Fixed Asset Cont'!M143","v":0},null,0,0,null,0,{"$f":"'App.2-BA_Fixed Asset Cont'!E289","v":0},null,0,null,0,0,0,0,0,{"$f":"-VLOOKUP(A192,'App.2-BA_Fixed Asset Cont'!$B$253:$M$292,11,)","v":0},0]
[1995,"Contributions & Grants",{"$f":"'App.2-BA_Fixed Asset Cont'!M144","v":-5819423.9699999997},null,-5819423.9699999997,-810945.87000000011,null,-810945.87000000011,{"$f":"'App.2-BA_Fixed Asset Cont'!E291","v":-810945.87000000011},{"$f":"C193/'App.2-BA_Fixed Asset Cont'!D290*'App.2-C_DepExp'!L193","v":21.425079504963815},4.6674272539726981E-2,25,0.04,-271617.38039999997,-32437.834800000004,-16218.917400000002,-320274.13259999995,{"$f":"-VLOOKUP(A193,'App.2-BA_Fixed Asset Cont'!$B$253:$M$292,11,)","v":-1258846.8400000001},-938572.70740000019]
[null,"Total",{"$f":"SUM(C156:C193)","v":26440673.971474718},23325.93,26417348.041474719,4319637.5687537631,0,4319637.5687537631,4319637.5687537631,null,null,null,null,{"$f":"SUM(N156:N193)","v":1790682.8289558697},129352.10855655718,64676.054278278592,1984710.9917907061,19229374.080000002,17244663.088209294]
[]
[]
["General:","Applicants are to complete this appendix to show the reasonability of the depreciation expense that is included in rate base via. Accumulated depreciation and the revenue requirement."]
[null,"Applicants must provide a breakdown of depreciation and amortization expense in the above format for all relevant accounts.  Balances presented in the table should exclude asset retirement obligations (AROs) and the related depreciation and accretion expense. These should be disclosed separately consistent with the Notes of historical Audited Financial Statements."]
[]
[]
["Notes:"]
[1,"This is the net book value of assets that existed as at the date of the utility's change in depreciation policies (i.e. as at Jan. 1, 2012 or Jan. 1, 2013).  These assets are to be depreciated at the average remaining service life. This amount will not change in years subsequent to the date of the utility's change in depreciation policies.  This column is expected to be used until the assets that existed as at the date of the utility's change in depreciation policies are fully depreciated."]
[2,"This is the opening gross book value of assets that have been acquired after the date of the utilities change in depreciation policies (i.e. additions starting in 2012/2013 for those who changed policies Jan. 1, 2012/2013). These assets are to be depreciated at the revised service life. The amount is expected to be equal to the gross book value of the prior year plus the prior year's additions."]
[3,"A recalculation should be performed to determine the average remaining life of opening balance of assets (i.e. excluding current year's additions) under the change in policies under CGAAP.  For example, Asset A had a useful life of 20 years under CGAAP without the change in policies.  On January 1 of the year of policy changes, Asset A was 3 years depreciated. As a result, Asset A would have a remaining service life of 17 years (20 years less 3 years) as at January 1 of the year of policy changes.  Due to making the change in policies under CGAAP, management re-assessed the asset useful lives and concluded that the revised useful life of Asset A is now 30 years. Therefore, the average remaining useful life of the opening balance of Asset A is determined to be 27 years (30 years less 3 years) under the revised CGAAP as at January 1 of the year of policy changes."]
[4,"The useful life used should be consistent with the OEB's regulatory accounting policies as set out in the  Accounting Procedures Handbook for Electricity Distributors, effective Jan. 1, 2012 and also with the Report of the Board, Transition to International Financial Reporting Standards, EB-2008-0408, and the Kinectrics Report."]
[5,"Board policy of the \"half-year\" rule - the applicant must ensure that additions in the year attract a half-year depreciation expense in the first year.  Deviations from this standard practice must be supported in the application."]
[6,"The applicant must provide an explanation of material variances in evidence."]
[7,"This should include assets in column a (excel column C) that become fully depreciated since the date of the policy change.  The amount input in b (excel column D) should equal the net book value of the asset as at the date of depreciation policy change"]
[8,"This should include assets in column d (excel column f) that have become fully depreciated.  The amount input in e (excel column G) should equal the gross book value of the asset"]
[]
[]
[]
[]
[]
["Scenario that applies",null,"Applicable Years and Accounting Standard",null,null,null,null,null,null,null,null,null,null,null,null,null,null,"Year Reflected in Schedule Below","Accounting Standard Reflected in Schedule Below"]
["Rebasing for the first time with depreciation policy changes made in 2012.",null,"This appendix must be duplicated and completed for the years 2012 to 2018. The appendix for 2012 is to be completed under CGAAP (prior to changes in depreciation policies). The appendix for 2012 to 2014 must be completed under Revised CGAAP (after changes in depreciation policies). The appendix for 2014 to 2018 is to be completed under MIFRS (2014 if changes to MIFRS are material)."]
["Rebasing for the first time with depreciation policy changes made in 2013.",null,"This appendix must be duplicated and completed for the years 2013 to 2018. The appendix for 2013 is to be completed under CGAAP (prior to changes in depreciation policies). The appendix for 2013 to 2014 must be completed under Revised CGAAP (after changes in depreciation policies). The appendix for 2014 to 2018 is to be completed under MIFRS (2014 if changes to MIFRS are material).",null,null,null,null,null,null,null,null,null,null,null,null,null,null,2014,"MIFRS"]
["Already rebased with depreciation policy changes in a prior rate application",null,"This appendix must be completed for 2014 to 2018. The appendix for 2014 is to be completed under Revised CGAAP (after changes in depreciation policies). The appendix for 2014 to 2018 is to be completed under MIFRS (2014 if changes to MIFRS are material)."]
[]
[]
[null,null,"Book Values",null,null,null,null,null,null,"Service Lives",null,null,null,"Depreciation Expense"]
["Account","Description","Opening Net  Book Value of Existing Assets as at Date of Policy Change (Jan. 1) 1","Less Fully Depreciated 7","Net Amount of Existing Assets Before Policy Change to be Depreciated ","Opening Gross Book Value of Assets Acquired After Policy Change 2","Less Fully Depreciated 8","Net Amount of Assets Acquired After Policy Change to be Depreciated ","Current Year Additions","Average Remaining Life of Assets Existing Before Policy Change 3","Depreciation Rate Assets Acquired After Policy Change","Life of Assets Acquired After Policy Change 4","Depreciation Rate on New Additions","Depreciation Expense on Assets Existing Before Policy Change","Depreciation Expense on Assets Acquired After Policy Change","Depreciation Expense on Current Year Additions 5","Total Current Year Depreciation Expense ","Depreciation Expense per Appendix 2-BA Fixed Assets, Column J \n ","Variance 6"]
[null,null,"a","b","c = a-b","d","e","f = d- e","g","h","i = 1/h","j","k = 1/j","l = c/h","m = f/j","n = g*0.5/j","o = l+m+n","p","q = p-o"]
[1611,"Computer Software (Formally known as Account 1925)",{"$f":"C156","v":402592.5},{"$f":"8268.33","v":8268.33},{"$f":"C224-D224","v":394324.17},{"$f":"I224","v":87557.439999999944},null,{"$f":"F224-G224","v":87557.439999999944},{"$f":"'App.2-BA_Fixed Asset Cont'!E324","v":87557.439999999944},{"$f":"C224/'App.2-BA_Fixed Asset Cont'!D324*'App.2-C_DepExp'!L224","v":1.0593299221362216},{"$f":"IF(J224=0,0,1/J224)","v":0.94399297055956077},3,{"$f":"IF(L224=0,0,1/L224)","v":0.33333333333333331},{"$f":"IF(J224=0,0,+E224/J224)","v":372239.24460173323},{"$f":"IF(L224=0,0,+H224/L224)","v":29185.813333333313},{"$f":"IF(L224=0,0,+(I224*0.5)/L224)","v":14592.906666666657},{"$f":"IF(ISERROR(+N224+O224+P224), 0, +N224+O224+P224)","v":416017.9646017332},{"$f":"-VLOOKUP(A224,'App.2-BA_Fixed Asset Cont'!$B$324:$M$362,11,)","v":896781.48},{"$f":"IF(ISERROR(+R224-122), 0, +R224-Q224)","v":480763.51539826678}]
[1612,"Land Rights (Formally known as Account 1906)",{"$f":"C157","v":43879.040000000001},null,{"$f":"C225-D225","v":43879.040000000001},{"$f":"I225","v":0},null,{"$f":"F225-G225","v":0},{"$f":"'App.2-BA_Fixed Asset Cont'!E325","v":0},null,{"$f":"IF(J225=0,0,1/J225)","v":0},null,{"$f":"IF(L225=0,0,1/L225)","v":0},{"$f":"IF(J225=0,0,+E225/J225)","v":0},{"$f":"IF(L225=0,0,+H225/L225)","v":0},{"$f":"IF(L225=0,0,+(I225*0.5)/L225)","v":0},{"$f":"IF(ISERROR(+N225+O225+P225), 0, +N225+O225+P225)","v":0},{"$f":"-VLOOKUP(A225,'App.2-BA_Fixed Asset Cont'!$B$324:$M$362,11,)","v":0},{"$f":"IF(ISERROR(+R225-122), 0, +R225-Q225)","v":0}]
[1805,"Land",104039.08,null,104039.08,0,null,0,{"$f":"'App.2-BA_Fixed Asset Cont'!E326","v":0},null,0,null,0,0,{"$f":"IF(L226=0,0,+H226/L226)","v":0},0,0,{"$f":"-VLOOKUP(A226,'App.2-BA_Fixed Asset Cont'!$B$324:$M$362,11,)","v":0},0]
[1808,"Buildings",145794.17000000001,null,145794.17000000001,4014,null,4014,{"$f":"'App.2-BA_Fixed Asset Cont'!E327","v":4014},{"$f":"(C227/'App.2-BA_Fixed Asset Cont'!D327)*L227","v":39.605742301642934},2.5248863974922084E-2,60,1.6666666666666666E-2,3681.1371666666664,66.900000000000006,33.450000000000003,3781.4871666666663,{"$f":"-VLOOKUP(A227,'App.2-BA_Fixed Asset Cont'!$B$324:$M$362,11,)","v":79062.58},75281.092833333329]
[1810,"Leasehold Improvements",0,null,0,0,null,0,{"$f":"'App.2-BA_Fixed Asset Cont'!E328","v":0},null,0,null,0,0,0,0,0,{"$f":"-VLOOKUP(A228,'App.2-BA_Fixed Asset Cont'!$B$324:$M$362,11,)","v":0},0]
[1815,"Transformer Station Equipment >50 kV",0,null,0,0,null,0,{"$f":"'App.2-BA_Fixed Asset Cont'!E329","v":0},null,0,null,0,0,0,0,0,{"$f":"-VLOOKUP(A229,'App.2-BA_Fixed Asset Cont'!$B$324:$M$362,11,)","v":0},0]
[1820,"Distribution Station Equipment <50 kV",423044.88709565229,null,423044.88709565229,0,null,0,{"$f":"'App.2-BA_Fixed Asset Cont'!E330","v":0},{"$f":"(C230/'App.2-BA_Fixed Asset Cont'!D330)*'App.2-C_DepExp'!L230","v":41.101335481223693},2.4330109673853045E-2,60,1.6666666666666666E-2,10292.728499999999,0,0,10292.728499999999,{"$f":"-VLOOKUP(A230,'App.2-BA_Fixed Asset Cont'!$B$324:$M$362,11,)","v":208825.75},198533.0215]
[1825,"Storage Battery Equipment",0,null,0,0,null,0,{"$f":"'App.2-BA_Fixed Asset Cont'!E331","v":0},null,0,null,0,0,0,0,0,{"$f":"-VLOOKUP(A231,'App.2-BA_Fixed Asset Cont'!$B$324:$M$362,11,)","v":0},0]
[1830,"Poles, Towers & Fixtures",4015623.2747665741,null,4015623.2747665741,1232100.26,null,1232100.26,{"$f":"'App.2-BA_Fixed Asset Cont'!E332","v":1232100.26},{"$f":"C232/'App.2-BA_Fixed Asset Cont'!D332*'App.2-C_DepExp'!L232","v":30.778500002006421},3.2490212321419527E-2,50,0.02,130468.45279999998,24642.0052,12321.0026,167431.46059999999,{"$f":"-VLOOKUP(A232,'App.2-BA_Fixed Asset Cont'!$B$324:$M$362,11,)","v":2646158.61},2478727.1494]
[1835,"Overhead Conductors & Devices",5049454.0686400868,null,5049454.0686400868,1338932.3300000008,null,1338932.3300000008,{"$f":"'App.2-BA_Fixed Asset Cont'!E333","v":1338932.3300000008},{"$f":"C233/'App.2-BA_Fixed Asset Cont'!D333*'App.2-C_DepExp'!L233","v":25.215735880118572},3.9657775793426407E-2,60,1.6666666666666666E-2,200250.1173333333,22315.538833333347,11157.769416666673,233723.42558333333,{"$f":"-VLOOKUP(A233,'App.2-BA_Fixed Asset Cont'!$B$324:$M$362,11,)","v":7244584.3499999996},7010860.9244166659]
[1840,"Underground Conduit",2378599.973294558,null,2378599.973294558,45672.279999999795,null,45672.279999999795,{"$f":"'App.2-BA_Fixed Asset Cont'!E334","v":45672.279999999795},{"$f":"C234/'App.2-BA_Fixed Asset Cont'!D334*'App.2-C_DepExp'!L234","v":39.388880428902439},2.5387875692608631E-2,45,2.2222222222222223E-2,60387.600444444441,1014.939555555551,507.46977777777551,61910.00977777777,{"$f":"-VLOOKUP(A234,'App.2-BA_Fixed Asset Cont'!$B$324:$M$362,11,)","v":421943.72},360033.7102222222]
[1845,"Underground Conductors & Devices",5103144.8589108996,null,5103144.8589108996,698300.43999999913,null,698300.43999999913,{"$f":"'App.2-BA_Fixed Asset Cont'!E335","v":698300.43999999913},{"$f":"C235/'App.2-BA_Fixed Asset Cont'!D335*'App.2-C_DepExp'!L235","v":38.132776778308518},2.6224158964705684E-2,45,2.2222222222222223E-2,133825.68199999997,15517.787555555537,7758.8937777777683,157102.36333333325,{"$f":"-VLOOKUP(A235,'App.2-BA_Fixed Asset Cont'!$B$324:$M$362,11,)","v":1112622.2899999998},955519.92666666652]
[1850,"Line Transformers",6551942.5093659144,null,6551942.5093659144,552590.61000000034,null,552590.61000000034,{"$f":"'App.2-BA_Fixed Asset Cont'!E336","v":552590.61000000034},{"$f":"C236/'App.2-BA_Fixed Asset Cont'!D336*'App.2-C_DepExp'!L236","v":33.70826593106159},2.9666313955311392E-2,40,2.5000000000000001E-2,194371.98349999997,13814.765250000008,6907.3826250000038,215094.13137499997,{"$f":"-VLOOKUP(A236,'App.2-BA_Fixed Asset Cont'!$B$324:$M$362,11,)","v":1359687.6799999999},1144593.5486250001]
[1855,"Services (Overhead & Underground)",2749228.0563997268,null,2749228.0563997268,523811.29000000004,null,523811.29000000004,{"$f":"'App.2-BA_Fixed Asset Cont'!E337","v":523811.29000000004},{"$f":"C237/'App.2-BA_Fixed Asset Cont'!D337*'App.2-C_DepExp'!L237","v":39.167225827131986},2.553155039403578E-2,60,1.6666666666666666E-2,70192.054666666663,8730.1881666666668,4365.0940833333334,83287.336916666653,{"$f":"-VLOOKUP(A237,'App.2-BA_Fixed Asset Cont'!$B$324:$M$362,11,)","v":1560837.58},1477550.2430833334]
[1860,"Meters",469081.23501596926,null,469081.23501596926,0,null,0,{"$f":"'App.2-BA_Fixed Asset Cont'!E338","v":0},null,0,25,0.04,0,0,0,0,{"$f":"-'App.2-BA_Fixed Asset Cont'!L338","v":1198433.1299999999},1198433.1299999999]
[1860,"Meters (Smart Meters)",3117386.2479853281,null,3117386.2479853281,134232.45999999996,null,134232.45999999996,{"$f":"'App.2-BA_Fixed Asset Cont'!E339","v":134232.45999999996},{"$f":"C239/'App.2-BA_Fixed Asset Cont'!D339*'App.2-C_DepExp'!L239","v":12.068694604980822},8.2859002794493958E-2,12,8.3333333333333329E-2,258303.51583333331,11186.03833333333,5593.0191666666651,275082.5733333333,{"$f":"-'App.2-BA_Fixed Asset Cont'!L339","v":309952.08999999997},34869.516666666663]
[1905,"Land",0,null,0,0,null,0,{"$f":"'App.2-BA_Fixed Asset Cont'!E340","v":0},null,0,null,0,0,0,0,0,{"$f":"-VLOOKUP(A240,'App.2-BA_Fixed Asset Cont'!$B$324:$M$362,11,)","v":0},0]
[1908,"Buildings & Fixtures",0,null,0,0,null,0,{"$f":"'App.2-BA_Fixed Asset Cont'!E341","v":0},null,0,null,0,0,0,0,0,{"$f":"-VLOOKUP(A241,'App.2-BA_Fixed Asset Cont'!$B$324:$M$362,11,)","v":0},0]
[1910,"Leasehold Improvements",223638.78,null,223638.78,47056.26999999999,null,47056.26999999999,{"$f":"'App.2-BA_Fixed Asset Cont'!E342","v":47056.26999999999},{"$f":"C242/'App.2-BA_Fixed Asset Cont'!D342*'App.2-C_DepExp'!L242","v":51.095237003319156},1.9571295851608238E-2,55,1.8181818181818181E-2,4376.9007272727276,855.5685454545453,427.78427272727265,5660.2535454545459,{"$f":"-VLOOKUP(A242,'App.2-BA_Fixed Asset Cont'!$B$324:$M$362,11,)","v":21895.449999999997},16235.19645454545]
[1915,"Office Furniture & Equipment (10 years)",21131.350000000006,null,21131.350000000006,2395,null,2395,{"$f":"'App.2-BA_Fixed Asset Cont'!E343","v":2395},{"$f":"C243/'App.2-BA_Fixed Asset Cont'!D343*'App.2-C_DepExp'!L243","v":2.3630830168592358},0.42317599206865614,10,0.1,8942.2799999999988,239.5,119.75,9301.5299999999988,{"$f":"-VLOOKUP(A243,'App.2-BA_Fixed Asset Cont'!$B$324:$M$362,11,)","v":70715.520000000004},61413.990000000005]
[1915,"Office Furniture & Equipment (5 years)",0,null,0,0,null,0,{"$f":"'App.2-BA_Fixed Asset Cont'!E344","v":0},null,0,null,0,0,0,0,0,null,0]
[1920,"Computer Equipment - Hardware",0,null,0,0,null,0,{"$f":"'App.2-BA_Fixed Asset Cont'!E345","v":0},null,0,null,0,0,0,0,0,{"$f":"-'App.2-BA_Fixed Asset Cont'!L345","v":97941},97941]
[1920,"Computer Equip.-Hardware(Post Mar. 22/04)",0,null,0,0,null,0,{"$f":"'App.2-BA_Fixed Asset Cont'!E346","v":0},null,0,null,0,0,0,0,0,{"$f":"-'App.2-BA_Fixed Asset Cont'!L346","v":3892},3892]
[1920,"Computer Equip.-Hardware(Post Mar. 19/07)",83695.75,null,83695.75,34018.25,null,34018.25,{"$f":"'App.2-BA_Fixed Asset Cont'!E347","v":34018.25},{"$f":"C247/'App.2-BA_Fixed Asset Cont'!D347*'App.2-C_DepExp'!L247","v":4.0574284719510798},0.24646152283718112,5,0.2,20627.782000000003,6803.65,3401.8249999999998,30833.257000000001,{"$f":"-'App.2-BA_Fixed Asset Cont'!L347","v":43472.619999999995},12639.362999999994]
[1930,"Transportation Equipment",1051728.2000000009,{"$f":"7413.19+6395.66","v":13808.849999999999},1037919.3500000009,137333.99999999991,null,137333.99999999991,{"$f":"'App.2-BA_Fixed Asset Cont'!E348","v":137333.99999999991},{"$f":"C248/'App.2-BA_Fixed Asset Cont'!D348*'App.2-C_DepExp'!L248","v":2.793564910100014},0.35796555017731752,8,0.125,371539.37116243411,17166.749999999989,8583.3749999999945,397289.49616243411,{"$f":"-VLOOKUP(A248,'App.2-BA_Fixed Asset Cont'!$B$324:$M$362,11,)","v":2148460.87},1751171.373837566]
[1935,"Stores Equipment",0,null,0,0,null,0,{"$f":"'App.2-BA_Fixed Asset Cont'!E349","v":0},null,0,null,0,0,0,0,0,{"$f":"-VLOOKUP(A249,'App.2-BA_Fixed Asset Cont'!$B$324:$M$362,11,)","v":0},0]
[1940,"Tools, Shop & Garage Equipment",74551.109999999986,7203.35,67347.75999999998,23803.409999999974,null,23803.409999999974,{"$f":"'App.2-BA_Fixed Asset Cont'!E350","v":23803.409999999974},{"$f":"C250/'App.2-BA_Fixed Asset Cont'!D350*'App.2-C_DepExp'!L250","v":3.8780344842904748},0.25786258581528831,10,0.1,17366.467542467439,2380.3409999999976,1190.1704999999988,20936.979042467436,{"$f":"-VLOOKUP(A250,'App.2-BA_Fixed Asset Cont'!$B$324:$M$362,11,)","v":139023.85999999999},118086.88095753256]
[1945,"Measurement & Testing Equipment",9193.1400000000012,null,9193.1400000000012,0,null,0,{"$f":"'App.2-BA_Fixed Asset Cont'!E351","v":0},{"$f":"C251/'App.2-BA_Fixed Asset Cont'!D351*'App.2-C_DepExp'!L251","v":5.0853623120261764},0.19664282280047948,8,0.125,1807.7650000000001,0,0,1807.7650000000001,{"$f":"-VLOOKUP(A251,'App.2-BA_Fixed Asset Cont'!$B$324:$M$362,11,)","v":7076.75},5268.9849999999997]
[1950,"Power Operated Equipment",43881.82,null,43881.82,0,null,0,{"$f":"'App.2-BA_Fixed Asset Cont'!E352","v":0},{"$f":"C252/'App.2-BA_Fixed Asset Cont'!D352*'App.2-C_DepExp'!L252","v":5.4774734516450154},0.18256592365585564,8,0.125,8011.3249999999998,0,0,8011.3249999999998,{"$f":"-VLOOKUP(A252,'App.2-BA_Fixed Asset Cont'!$B$324:$M$362,11,)","v":28220.11},20208.785]
[1955,"Communications Equipment",0,null,0,0,null,0,{"$f":"'App.2-BA_Fixed Asset Cont'!E353","v":0},null,0,null,0,0,0,0,0,{"$f":"-VLOOKUP(A253,'App.2-BA_Fixed Asset Cont'!$B$324:$M$362,11,)","v":0},0]
[1955,"Communication Equipment (Smart Meters)",0,null,0,0,null,0,{"$f":"'App.2-BA_Fixed Asset Cont'!E354","v":0},null,0,null,0,0,0,0,0,{"$f":"-VLOOKUP(A254,'App.2-BA_Fixed Asset Cont'!$B$324:$M$362,11,)","v":0},0]
[1960,"Miscellaneous Equipment ",0,null,0,0,null,0,{"$f":"'App.2-BA_Fixed Asset Cont'!E355","v":0},null,0,null,0,0,0,0,0,{"$f":"-VLOOKUP(A255,'App.2-BA_Fixed Asset Cont'!$B$324:$M$362,11,)","v":0},0]
[1970,"Load Management Controls Customer Premises",0,null,0,0,null,0,{"$f":"'App.2-BA_Fixed Asset Cont'!E356","v":0},null,0,null,0,0,0,0,0,{"$f":"-VLOOKUP(A256,'App.2-BA_Fixed Asset Cont'!$B$324:$M$362,11,)","v":0},0]
[1975,"Load Management Controls Utility Premises",0,null,0,0,null,0,{"$f":"'App.2-BA_Fixed Asset Cont'!E357","v":0},null,0,null,0,0,0,0,0,{"$f":"-VLOOKUP(A257,'App.2-BA_Fixed Asset Cont'!$B$324:$M$362,11,)","v":0},0]
[1980,"System Supervisor Equipment",198467.89,null,198467.89,3856.3099999999977,null,3856.3099999999977,{"$f":"'App.2-BA_Fixed Asset Cont'!E358","v":3856.3099999999977},{"$f":"C258/'App.2-BA_Fixed Asset Cont'!D358*'App.2-C_DepExp'!L258","v":3.8735926727328032},0.25815827436871525,5,0.2,51236.127999999997,771.26199999999949,385.63099999999974,52393.021000000001,{"$f":"-VLOOKUP(A258,'App.2-BA_Fixed Asset Cont'!$B$324:$M$362,11,)","v":57712.75},5319.7289999999994]
[1985,"Miscellaneous Fixed Assets",0,null,0,0,null,0,{"$f":"'App.2-BA_Fixed Asset Cont'!E359","v":0},null,0,null,0,0,0,0,0,{"$f":"-VLOOKUP(A259,'App.2-BA_Fixed Asset Cont'!$B$324:$M$362,11,)","v":0},0]
[1990,"Other Tangible Property",0,null,0,0,null,0,{"$f":"'App.2-BA_Fixed Asset Cont'!E360","v":0},null,0,null,0,0,0,0,0,{"$f":"-VLOOKUP(A260,'App.2-BA_Fixed Asset Cont'!$B$324:$M$362,11,)","v":0},0]
[1995,"Contributions & Grants",-5819423.9699999997,null,-5819423.9699999997,0,null,0,{"$f":"'App.2-BA_Fixed Asset Cont'!E361","v":0},{"$f":"C261/'App.2-BA_Fixed Asset Cont'!D361*'App.2-C_DepExp'!L261","v":21.425079504963815},4.6674272539726981E-2,25,0.04,-271617.38039999997,0,0,-271617.38039999997,{"$f":"-VLOOKUP(A261,'App.2-BA_Fixed Asset Cont'!$B$324:$M$362,11,)","v":-971010.54},-699393.15960000013]
[2440,"Deferred Revenue",null,null,null,{"$f":"I262","v":-810945.87000000011},null,-810945.87000000011,{"$f":"'App.2-BA_Fixed Asset Cont'!E362","v":-810945.87000000011},60,1.6666666666666666E-2,60,1.6666666666666666E-2,{"$f":"IF(J262=0,0,+E262/J262)","v":0},{"$f":"IF(L262=0,0,+H262/L262)","v":-13515.764500000001},{"$f":"IF(L262=0,0,+(I262*0.5)/L262)","v":-6757.8822500000006},{"$f":"IF(ISERROR(+N262+O262+P262), 0, +N262+O262+P262)","v":-20273.64675},{"$f":"-VLOOKUP(A262,'App.2-BA_Fixed Asset Cont'!$B$324:$M$362,11,)","v":-119931.79},-99658.143249999994]
[null,"Total",{"$f":"SUM(C224:C262)","v":26440673.971474718},{"$f":"SUM(D224:D262)","v":29280.53},26411393.441474717,4054728.4799999995,0,4054728.4799999995,4054728.4799999995,null,null,null,null,{"$f":"SUM(N224:N262)","v":1646303.155878352},141175.28327323229,70587.641636616143,1858066.0807882003,18566357.859999999,{"$f":"SUM(S224:S262)","v":16708291.779211793}]
[]
[]
["General:","Applicants are to complete this appendix to show the reasonability of the depreciation expense that is included in rate base via. Accumulated depreciation and the revenue requirement."]
[null,"Applicants must provide a breakdown of depreciation and amortization expense in the above format for all relevant accounts.  Balances presented in the table should exclude asset retirement obligations (AROs) and the related depreciation and accretion expense. These should be disclosed separately consistent with the Notes of historical Audited Financial Statements."]
[]
[]
["Notes:"]
[1,"This is the net book value of assets that existed as at the date of the utility's change in depreciation policies (i.e. as at Jan. 1, 2012 or Jan. 1, 2013).  These assets are to be depreciated at the average remaining service life. This amount will not change in years subsequent to the date of the utility's change in depreciation policies.  This column is expected to be used until the assets that existed as at the date of the utility's change in depreciation policies are fully depreciated."]
[2,"This is the opening gross book value of assets that have been acquired after the date of the utilities change in depreciation policies (i.e. additions starting in 2012/2013 for those who changed policies Jan. 1, 2012/2013). These assets are to be depreciated at the revised service life. The amount is expected to be equal to the gross book value of the prior year plus the prior year's additions."]
[3,"A recalculation should be performed to determine the average remaining life of opening balance of assets (i.e. excluding current year's additions) under the change in policies under CGAAP.  For example, Asset A had a useful life of 20 years under CGAAP without the change in policies.  On January 1 of the year of policy changes, Asset A was 3 years depreciated. As a result, Asset A would have a remaining service life of 17 years (20 years less 3 years) as at January 1 of the year of policy changes.  Due to making the change in policies under CGAAP, management re-assessed the asset useful lives and concluded that the revised useful life of Asset A is now 30 years. Therefore, the average remaining useful life of the opening balance of Asset A is determined to be 27 years (30 years less 3 years) under the revised CGAAP as at January 1 of the year of policy changes."]
[4,"The useful life used should be consistent with the OEB's regulatory accounting policies as set out in the  Accounting Procedures Handbook for Electricity Distributors, effective Jan. 1, 2012 and also with the Report of the Board, Transition to International Financial Reporting Standards, EB-2008-0408, and the Kinectrics Report."]
[5,"Board policy of the \"half-year\" rule - the applicant must ensure that additions in the year attract a half-year depreciation expense in the first year.  Deviations from this standard practice must be supported in the application."]
[6,"The applicant must provide an explanation of material variances in evidence."]
[7,"This should include assets in column a (excel column C) that become fully depreciated since the date of the policy change.  The amount input in b (excel column D) should equal the net book value of the asset as at the date of depreciation policy change"]
[8,"This should include assets in column d (excel column f) that have become fully depreciated.  The amount input in e (excel column G) should equal the gross book value of the asset"]
[]
[]
[]
[]
["Scenario that applies",null,"Applicable Years and Accounting Standard",null,null,null,null,null,null,null,null,null,null,null,null,null,null,"Year Reflected in Schedule Below","Accounting Standard Reflected in Schedule Below"]
["Rebasing for the first time with depreciation policy changes made in 2012.",null,"This appendix must be duplicated and completed for the years 2012 to 2018. The appendix for 2012 is to be completed under CGAAP (prior to changes in depreciation policies). The appendix for 2012 to 2014 must be completed under Revised CGAAP (after changes in depreciation policies). The appendix for 2014 to 2018 is to be completed under MIFRS (2014 if changes to MIFRS are material)."]
["Rebasing for the first time with depreciation policy changes made in 2013.",null,"This appendix must be duplicated and completed for the years 2013 to 2018. The appendix for 2013 is to be completed under CGAAP (prior to changes in depreciation policies). The appendix for 2013 to 2014 must be completed under Revised CGAAP (after changes in depreciation policies). The appendix for 2014 to 2018 is to be completed under MIFRS (2014 if changes to MIFRS are material).",null,null,null,null,null,null,null,null,null,null,null,null,null,null,2015,"MIFRS"]
["Already rebased with depreciation policy changes in a prior rate application",null,"This appendix must be completed for 2014 to 2018. The appendix for 2014 is to be completed under Revised CGAAP (after changes in depreciation policies). The appendix for 2014 to 2018 is to be completed under MIFRS (2014 if changes to MIFRS are material)."]
[]
[]
[null,null,"Book Values",null,null,null,null,null,null,"Service Lives",null,null,null,"Depreciation Expense"]
["Account","Description","Opening Net  Book Value of Existing Assets as at Date of Policy Change (Jan. 1) 1","Less Fully Depreciated 7","Net Amount of Existing Assets Before Policy Change to be Depreciated ","Opening Gross Book Value of Assets Acquired After Policy Change 2","Less Fully Depreciated 8","Net Amount of Assets Acquired After Policy Change to be Depreciated ","Current Year Additions","Average Remaining Life of Assets Existing Before Policy Change 3","Depreciation Rate Assets Acquired After Policy Change","Life of Assets Acquired After Policy Change 4","Depreciation Rate on New Additions","Depreciation Expense on Assets Existing Before Policy Change","Depreciation Expense on Assets Acquired After Policy Change","Depreciation Expense on Current Year Additions 5","Total Current Year Depreciation Expense ","Depreciation Expense per Appendix 2-BA Fixed Assets, Column J \n ","Variance 6"]
[null,null,"a","b","c = a-b","d","e","f = d- e","g","h","i = 1/h","j","k = 1/j","l = c/h","m = f/j","n = g*0.5/j","o = l+m+n","p","q = p-o"]
[1611,"Computer Software (Formally known as Account 1925)",{"$f":"'App.2-BA_Fixed Asset Cont'!M324","v":330909.42999999993},{"$f":"13365.3066666667","v":13365.3066666667},{"$f":"C292-D292","v":317544.12333333323},{"$f":"I292","v":218360.80000000005},null,{"$f":"F292-G292","v":218360.80000000005},{"$f":"'App.2-BA_Fixed Asset Cont'!E412","v":218360.80000000005},{"$f":"C292/'App.2-BA_Fixed Asset Cont'!D412*'App.2-C_DepExp'!L292","v":0.8086141893809411},{"$f":"IF(J292=0,0,1/J292)","v":1.2366837153396728},3,{"$f":"IF(L292=0,0,1/L292)","v":0.33333333333333331},{"$f":"IF(J292=0,0,+E292/J292)","v":392701.64622814581},{"$f":"IF(L292=0,0,+H292/L292)","v":72786.933333333349},{"$f":"IF(L292=0,0,+(I292*0.5)/L292)","v":36393.466666666674},{"$f":"IF(ISERROR(+N292+O292+P292), 0, +N292+O292+P292)","v":501882.04622814583},{"$f":"-VLOOKUP(A292,'App.2-BA_Fixed Asset Cont'!$B$412:$M$450,11,)","v":1020368.13},{"$f":"IF(ISERROR(+R292-122), 0, +R292-Q292)","v":518486.08377185417}]
[1612,"Land Rights (Formally known as Account 1906)",{"$f":"'App.2-BA_Fixed Asset Cont'!M325","v":43879.040000000001},null,{"$f":"C293-D293","v":43879.040000000001},{"$f":"I293","v":0},null,{"$f":"F293-G293","v":0},{"$f":"'App.2-BA_Fixed Asset Cont'!E413","v":0},null,{"$f":"IF(J293=0,0,1/J293)","v":0},null,{"$f":"IF(L293=0,0,1/L293)","v":0},{"$f":"IF(J293=0,0,+E293/J293)","v":0},{"$f":"IF(L293=0,0,+H293/L293)","v":0},{"$f":"IF(L293=0,0,+(I293*0.5)/L293)","v":0},{"$f":"IF(ISERROR(+N293+O293+P293), 0, +N293+O293+P293)","v":0},{"$f":"-VLOOKUP(A293,'App.2-BA_Fixed Asset Cont'!$B$412:$M$450,11,)","v":0},{"$f":"IF(ISERROR(+R293-122), 0, +R293-Q293)","v":0}]
[1805,"Land",{"$f":"'App.2-BA_Fixed Asset Cont'!M326","v":104039.08},null,104039.08,0,null,0,{"$f":"'App.2-BA_Fixed Asset Cont'!E414","v":0},null,0,null,0,0,{"$f":"IF(L294=0,0,+H294/L294)","v":0},0,0,{"$f":"-VLOOKUP(A294,'App.2-BA_Fixed Asset Cont'!$B$412:$M$450,11,)","v":0},0]
[1808,"Buildings",{"$f":"'App.2-BA_Fixed Asset Cont'!M327","v":145819.65000000002},null,145819.65000000002,28387.339999999997,null,28387.339999999997,{"$f":"'App.2-BA_Fixed Asset Cont'!E415","v":28387.339999999997},{"$f":"(C295/'App.2-BA_Fixed Asset Cont'!D415)*L295","v":38.905604057732802},2.5703237983815391E-2,60,1.6666666666666666E-2,3748.0371666666665,473.1223333333333,236.56116666666665,4457.7206666666661,{"$f":"-VLOOKUP(A295,'App.2-BA_Fixed Asset Cont'!$B$412:$M$450,11,)","v":83321.11},78863.38933333334]
[1810,"Leasehold Improvements",{"$f":"'App.2-BA_Fixed Asset Cont'!M328","v":0},null,0,0,null,0,{"$f":"'App.2-BA_Fixed Asset Cont'!E416","v":0},null,0,null,0,0,0,0,0,{"$f":"-VLOOKUP(A296,'App.2-BA_Fixed Asset Cont'!$B$412:$M$450,11,)","v":0},0]
[1815,"Transformer Station Equipment >50 kV",{"$f":"'App.2-BA_Fixed Asset Cont'!M329","v":0},null,0,0,null,0,{"$f":"'App.2-BA_Fixed Asset Cont'!E417","v":0},null,0,null,0,0,0,0,0,{"$f":"-VLOOKUP(A297,'App.2-BA_Fixed Asset Cont'!$B$412:$M$450,11,)","v":0},0]
[1820,"Distribution Station Equipment <50 kV",{"$f":"'App.2-BA_Fixed Asset Cont'!M330","v":408737.95999999996},null,408737.95999999996,7.2759576141834259E-11,null,7.2759576141834259E-11,{"$f":"'App.2-BA_Fixed Asset Cont'!E418","v":7.2759576141834259E-11},{"$f":"(C298/'App.2-BA_Fixed Asset Cont'!D418)*'App.2-C_DepExp'!L298","v":39.711332131222541},2.5181728900344858E-2,60,1.6666666666666666E-2,10292.728499999999,1.2126596023639042E-12,6.0632980118195212E-13,10292.728500000001,{"$f":"-VLOOKUP(A298,'App.2-BA_Fixed Asset Cont'!$B$412:$M$450,11,)","v":201825.83},191533.10149999999]
[1825,"Storage Battery Equipment",{"$f":"'App.2-BA_Fixed Asset Cont'!M331","v":0},null,0,0,null,0,{"$f":"'App.2-BA_Fixed Asset Cont'!E419","v":0},null,0,null,0,0,0,0,0,{"$f":"-VLOOKUP(A299,'App.2-BA_Fixed Asset Cont'!$B$412:$M$450,11,)","v":0},0]
[1830,"Poles, Towers & Fixtures",{"$f":"'App.2-BA_Fixed Asset Cont'!M332","v":5064967.82},null,5064967.82,706809.00000000035,null,706809.00000000035,{"$f":"'App.2-BA_Fixed Asset Cont'!E420","v":706809.00000000035},{"$f":"C300/'App.2-BA_Fixed Asset Cont'!D420*'App.2-C_DepExp'!L300","v":32.841945116441309},3.0448866425374446E-2,50,0.02,154222.52860000002,14136.180000000008,7068.0900000000038,175426.79860000001,{"$f":"-VLOOKUP(A300,'App.2-BA_Fixed Asset Cont'!$B$412:$M$450,11,)","v":2744056.8499999996},2568630.0513999998]
[1835,"Overhead Conductors & Devices",{"$f":"'App.2-BA_Fixed Asset Cont'!M333","v":6107455.7400000002},null,6107455.7400000002,983489.00000000058,null,983489.00000000058,{"$f":"'App.2-BA_Fixed Asset Cont'!E421","v":983489.00000000058},{"$f":"C301/'App.2-BA_Fixed Asset Cont'!D421*'App.2-C_DepExp'!L301","v":27.445045246265437},3.6436449312688753E-2,60,1.6666666666666666E-2,222534.00149999998,16391.483333333344,8195.7416666666722,247121.22649999999,{"$f":"-VLOOKUP(A301,'App.2-BA_Fixed Asset Cont'!$B$412:$M$450,11,)","v":7465467.5599999996},7218346.3334999997]
[1840,"Underground Conduit",{"$f":"'App.2-BA_Fixed Asset Cont'!M334","v":2341170.58},null,2341170.58,113924.05000000028,null,113924.05000000028,{"$f":"'App.2-BA_Fixed Asset Cont'!E422","v":113924.05000000028},{"$f":"C302/'App.2-BA_Fixed Asset Cont'!D422*'App.2-C_DepExp'!L302","v":38.128236714637538},2.6227281567838597E-2,45,2.2222222222222223E-2,61402.54,2531.6455555555617,1265.8227777777809,65200.008333333339,{"$f":"-VLOOKUP(A302,'App.2-BA_Fixed Asset Cont'!$B$412:$M$450,11,)","v":490307.01},425107.00166666665]
[1845,"Underground Conductors & Devices",{"$f":"'App.2-BA_Fixed Asset Cont'!M335","v":5606712.0199999986},null,5606712.0199999986,298197.3900000006,null,298197.3900000006,{"$f":"'App.2-BA_Fixed Asset Cont'!E423","v":298197.3900000006},{"$f":"C303/'App.2-BA_Fixed Asset Cont'!D423*'App.2-C_DepExp'!L303","v":37.548666171366605},2.6632104465073317E-2,45,2.2222222222222223E-2,149318.54022222219,6626.6086666666797,3313.3043333333399,159258.45322222219,{"$f":"-VLOOKUP(A303,'App.2-BA_Fixed Asset Cont'!$B$412:$M$450,11,)","v":1283508.4599999997},1124250.0067777776]
[1850,"Line Transformers",{"$f":"'App.2-BA_Fixed Asset Cont'!M336","v":6898776.3099999996},null,6898776.3099999996,725235.29999999888,null,725235.29999999888,{"$f":"'App.2-BA_Fixed Asset Cont'!E424","v":725235.29999999888},{"$f":"C304/'App.2-BA_Fixed Asset Cont'!D424*'App.2-C_DepExp'!L304","v":33.414331373744957},2.9927278472665832E-2,40,2.5000000000000001E-2,206461.59975000002,18130.882499999971,9065.4412499999853,233657.92349999998,{"$f":"-VLOOKUP(A304,'App.2-BA_Fixed Asset Cont'!$B$412:$M$450,11,)","v":1487577.22},1253919.2964999999]
[1855,"Services (Overhead & Underground)",{"$f":"'App.2-BA_Fixed Asset Cont'!M337","v":3174496.99},null,3174496.99,605659.81000000052,null,605659.81000000052,{"$f":"'App.2-BA_Fixed Asset Cont'!E425","v":605659.81000000052},{"$f":"C305/'App.2-BA_Fixed Asset Cont'!D425*'App.2-C_DepExp'!L305","v":40.223096506568488},2.4861338058264574E-2,60,1.6666666666666666E-2,78922.242833333337,10094.330166666676,5047.1650833333379,94063.738083333359,{"$f":"-VLOOKUP(A305,'App.2-BA_Fixed Asset Cont'!$B$412:$M$450,11,)","v":1644807.28},1550743.5419166666]
[1860,"Meters",{"$f":"'App.2-BA_Fixed Asset Cont'!M338","v":459051.75000000047},null,459051.75000000047,0,null,0,{"$f":"'App.2-BA_Fixed Asset Cont'!E426","v":0},null,0,25,0.04,0,0,0,0,{"$f":"'App.2-BA_Fixed Asset Cont'!L426","v":0},0]
[1860,"Meters (Smart Meters)",{"$f":"'App.2-BA_Fixed Asset Cont'!M339","v":2900902.81},null,2900902.81,353471.40999999922,null,353471.40999999922,{"$f":"'App.2-BA_Fixed Asset Cont'!E427","v":353471.40999999922},{"$f":"C307/'App.2-BA_Fixed Asset Cont'!D427*'App.2-C_DepExp'!L307","v":7.1504527812559537},0.13985128363079033,12,8.3333333333333329E-2,405694.98166666669,29455.950833333267,14727.975416666633,449878.90791666659,{"$f":"-'App.2-BA_Fixed Asset Cont'!L427","v":1783927.3499999996},1334048.4420833332]
[1905,"Land",{"$f":"'App.2-BA_Fixed Asset Cont'!M340","v":0},null,0,0,null,0,{"$f":"'App.2-BA_Fixed Asset Cont'!E428","v":0},null,0,null,0,0,0,0,0,{"$f":"'App.2-BA_Fixed Asset Cont'!L428","v":0},0]
[1908,"Buildings & Fixtures",{"$f":"'App.2-BA_Fixed Asset Cont'!M341","v":0},null,0,0,null,0,{"$f":"'App.2-BA_Fixed Asset Cont'!E429","v":0},null,0,null,0,0,0,0,0,{"$f":"'App.2-BA_Fixed Asset Cont'!L429","v":0},0]
[1910,"Leasehold Improvements",{"$f":"'App.2-BA_Fixed Asset Cont'!M342","v":265890.36},null,265890.36,127047.06,null,127047.06,{"$f":"'App.2-BA_Fixed Asset Cont'!E430","v":127047.06},{"$f":"C310/'App.2-BA_Fixed Asset Cont'!D427*'App.2-C_DepExp'!L310","v":3.0038925919012165},0.33290138359011112,55,1.8181818181818181E-2,88515.268727272734,2309.9465454545452,1154.9732727272726,91980.188545454555,{"$f":"-'App.2-BA_Fixed Asset Cont'!L430","v":28282.89},-63697.298545454556]
[1915,"Office Furniture & Equipment (10 years)",{"$f":"'App.2-BA_Fixed Asset Cont'!M343","v":21102.28},323.19,20779.09,5891.6499999999942,null,5891.6499999999942,{"$f":"'App.2-BA_Fixed Asset Cont'!E431","v":5891.6499999999942},{"$f":"C311/'App.2-BA_Fixed Asset Cont'!D431*'App.2-C_DepExp'!L311","v":2.2982776760061774},0.4351084337806152,10,0.1,9041.1573052864442,589.1649999999994,294.5824999999997,9924.9048052864437,{"$f":"-VLOOKUP(A311,'App.2-BA_Fixed Asset Cont'!$B$412:$M$450,11,)","v":74854.62000000001},64929.715194713564]
[1915,"Office Furniture & Equipment (5 years)",{"$f":"'App.2-BA_Fixed Asset Cont'!M344","v":0},null,0,0,null,0,{"$f":"'App.2-BA_Fixed Asset Cont'!E432","v":0},null,0,null,0,0,0,0,0,null,0]
[1920,"Computer Equipment - Hardware",{"$f":"'App.2-BA_Fixed Asset Cont'!M345","v":0},null,0,0,null,0,{"$f":"'App.2-BA_Fixed Asset Cont'!E433","v":0},null,0,null,0,0,0,0,0,{"$f":"-'App.2-BA_Fixed Asset Cont'!L433","v":97941},97941]
[1920,"Computer Equip.-Hardware(Post Mar. 22/04)",{"$f":"'App.2-BA_Fixed Asset Cont'!M346","v":0},null,0,0,null,0,{"$f":"'App.2-BA_Fixed Asset Cont'!E434","v":0},null,0,null,0,0,0,0,0,{"$f":"-'App.2-BA_Fixed Asset Cont'!L434","v":3892},3892]
[1920,"Computer Equip.-Hardware(Post Mar. 19/07)",{"$f":"'App.2-BA_Fixed Asset Cont'!M347","v":93684.540000000008},null,93684.540000000008,11372.01999999999,null,11372.01999999999,{"$f":"'App.2-BA_Fixed Asset Cont'!E435","v":11372.01999999999},{"$f":"C315/'App.2-BA_Fixed Asset Cont'!D435*'App.2-C_DepExp'!L315","v":3.4152260078875942},0.2928063904674133,5,0.2,27431.432000000001,2274.4039999999977,1137.2019999999989,30843.037999999997,{"$f":"-'App.2-BA_Fixed Asset Cont'!L435","v":72041.11},41198.072]
[1930,"Transportation Equipment",{"$f":"'App.2-BA_Fixed Asset Cont'!M348","v":958289.99000000069},832.53,957457.46000000066,212572.78000000017,null,212572.78000000017,{"$f":"'App.2-BA_Fixed Asset Cont'!E436","v":212572.78000000017},{"$f":"C316/'App.2-BA_Fixed Asset Cont'!D436*'App.2-C_DepExp'!L316","v":2.4676326701008793},0.40524670147081454,8,0.125,388006.47746362461,26571.597500000022,13285.798750000011,427863.87371362466,{"$f":"-VLOOKUP(A316,'App.2-BA_Fixed Asset Cont'!$B$412:$M$450,11,)","v":2179044.58},1751180.7062863754]
[1935,"Stores Equipment",{"$f":"'App.2-BA_Fixed Asset Cont'!M349","v":0},null,0,0,null,0,{"$f":"'App.2-BA_Fixed Asset Cont'!E437","v":0},null,0,null,0,0,0,0,0,{"$f":"-VLOOKUP(A317,'App.2-BA_Fixed Asset Cont'!$B$412:$M$450,11,)","v":0},0]
[1940,"Tools, Shop & Garage Equipment",{"$f":"'App.2-BA_Fixed Asset Cont'!M350","v":77018.969999999972},1100.69,75918.27999999997,12250.850000000006,null,12250.850000000006,{"$f":"'App.2-BA_Fixed Asset Cont'!E438","v":12250.850000000006},{"$f":"C318/'App.2-BA_Fixed Asset Cont'!D438*'App.2-C_DepExp'!L318","v":3.5649861650118169},0.28050599741855808,10,0.1,21295.532853701363,1225.0850000000005,612.54250000000025,23133.160353701362,{"$f":"-VLOOKUP(A318,'App.2-BA_Fixed Asset Cont'!$B$412:$M$450,11,)","v":155133.34},132000.17964629864]
[1945,"Measurement & Testing Equipment",{"$f":"'App.2-BA_Fixed Asset Cont'!M351","v":7385.3700000000008},null,7385.3700000000008,16620,null,16620,{"$f":"'App.2-BA_Fixed Asset Cont'!E439","v":16620},{"$f":"C319/'App.2-BA_Fixed Asset Cont'!D439*'App.2-C_DepExp'!L319","v":4.0853595461799515},0.24477649731834694,8,0.125,1807.7650000000001,2077.5,1038.75,4924.0150000000003,{"$f":"-VLOOKUP(A319,'App.2-BA_Fixed Asset Cont'!$B$412:$M$450,11,)","v":9923.27},4999.2550000000001]
[1950,"Power Operated Equipment",{"$f":"'App.2-BA_Fixed Asset Cont'!M352","v":35870.49},null,35870.49,158994.97,null,158994.97,{"$f":"'App.2-BA_Fixed Asset Cont'!E440","v":158994.97},{"$f":"C320/'App.2-BA_Fixed Asset Cont'!D440*'App.2-C_DepExp'!L320","v":4.4774728275285298},0.22334027218474017,8,0.125,8011.3249999999998,19874.37125,9937.1856250000001,37822.881874999999,{"$f":"-VLOOKUP(A320,'App.2-BA_Fixed Asset Cont'!$B$412:$M$450,11,)","v":26260.639999999999},-11562.241875]
[1955,"Communications Equipment",{"$f":"'App.2-BA_Fixed Asset Cont'!M353","v":0},null,0,0,null,0,{"$f":"'App.2-BA_Fixed Asset Cont'!E441","v":0},null,0,null,0,0,0,0,0,{"$f":"-VLOOKUP(A321,'App.2-BA_Fixed Asset Cont'!$B$412:$M$450,11,)","v":0},0]
[1955,"Communication Equipment (Smart Meters)",{"$f":"'App.2-BA_Fixed Asset Cont'!M354","v":0},null,0,0,null,0,{"$f":"'App.2-BA_Fixed Asset Cont'!E442","v":0},null,0,null,0,0,0,0,0,{"$f":"-VLOOKUP(A322,'App.2-BA_Fixed Asset Cont'!$B$412:$M$450,11,)","v":0},0]
[1960,"Miscellaneous Equipment ",{"$f":"'App.2-BA_Fixed Asset Cont'!M355","v":0},null,0,0,null,0,{"$f":"'App.2-BA_Fixed Asset Cont'!E443","v":0},null,0,null,0,0,0,0,0,{"$f":"-VLOOKUP(A323,'App.2-BA_Fixed Asset Cont'!$B$412:$M$450,11,)","v":0},0]
[1970,"Load Management Controls Customer Premises",{"$f":"'App.2-BA_Fixed Asset Cont'!M356","v":0},null,0,0,null,0,{"$f":"'App.2-BA_Fixed Asset Cont'!E444","v":0},null,0,null,0,0,0,0,0,{"$f":"-VLOOKUP(A324,'App.2-BA_Fixed Asset Cont'!$B$412:$M$450,11,)","v":0},0]
[1975,"Load Management Controls Utility Premises",{"$f":"'App.2-BA_Fixed Asset Cont'!M357","v":0},null,0,0,null,0,{"$f":"'App.2-BA_Fixed Asset Cont'!E445","v":0},null,0,null,0,0,0,0,0,{"$f":"-VLOOKUP(A325,'App.2-BA_Fixed Asset Cont'!$B$412:$M$450,11,)","v":0},0]
[1980,"System Supervisor Equipment",{"$f":"'App.2-BA_Fixed Asset Cont'!M358","v":202324.2},null,202324.2,64232.049999999988,null,64232.049999999988,{"$f":"'App.2-BA_Fixed Asset Cont'!E446","v":64232.049999999988},{"$f":"C326/'App.2-BA_Fixed Asset Cont'!D446*'App.2-C_DepExp'!L326","v":3.8902971289272541},0.25704977456972522,5,0.2,52007.390000000007,12846.409999999998,6423.204999999999,71277.005000000005,{"$f":"-VLOOKUP(A326,'App.2-BA_Fixed Asset Cont'!$B$412:$M$450,11,)","v":116143.35},44866.345000000001]
[1985,"Miscellaneous Fixed Assets",{"$f":"'App.2-BA_Fixed Asset Cont'!M359","v":0},null,0,0,null,0,{"$f":"'App.2-BA_Fixed Asset Cont'!E447","v":0},null,0,null,0,0,0,0,0,{"$f":"-VLOOKUP(A327,'App.2-BA_Fixed Asset Cont'!$B$412:$M$450,11,)","v":0},0]
[1990,"Other Tangible Property",{"$f":"'App.2-BA_Fixed Asset Cont'!M360","v":0},null,0,0,null,0,{"$f":"'App.2-BA_Fixed Asset Cont'!E448","v":0},null,0,null,0,0,0,0,0,{"$f":"-VLOOKUP(A328,'App.2-BA_Fixed Asset Cont'!$B$412:$M$450,11,)","v":0},0]
[1995,"Contributions & Grants",{"$f":"'App.2-BA_Fixed Asset Cont'!M361","v":-5819423.9699999997},null,-5819423.9699999997,0,null,0,{"$f":"'App.2-BA_Fixed Asset Cont'!E449","v":0},{"$f":"C329/'App.2-BA_Fixed Asset Cont'!D449*'App.2-C_DepExp'!L329","v":21.425079504963815},4.6674272539726981E-2,25,0.04,-271617.38039999997,0,0,-271617.38039999997,{"$f":"-VLOOKUP(A329,'App.2-BA_Fixed Asset Cont'!$B$412:$M$450,11,)","v":-1097699.54},-826082.15960000013]
[2440,"Deferred Revenue",{"$f":"'App.2-BA_Fixed Asset Cont'!M362","v":-691014.08000000007},null,null,{"$f":"I330","v":-667718.79999999981},null,-667718.79999999981,{"$f":"'App.2-BA_Fixed Asset Cont'!E450","v":-667718.79999999981},60,1.6666666666666666E-2,60,1.6666666666666666E-2,0,-11128.646666666664,-5564.3233333333319,-16692.969999999994,{"$f":"-VLOOKUP(A330,'App.2-BA_Fixed Asset Cont'!$B$412:$M$450,11,)","v":-125496.10999999999},-108803.13999999998]
[null,"Total",{"$f":"SUM(C292:C330)","v":28738047.330000006},15621.716666666702,29413439.693333343,3974796.6799999997,0,3974796.6799999997,3974796.6799999997,null,null,null,null,{"$f":"SUM(N292:N330)","v":2009797.8144169205},227266.96935101014,113633.48467550507,2350698.2684434345,19745487.950000003,17394789.68155656]
[]
[]
["General:","Applicants are to complete this appendix to show the reasonability of the depreciation expense that is included in rate base via. Accumulated depreciation and the revenue requirement."]
[null,"Applicants must provide a breakdown of depreciation and amortization expense in the above format for all relevant accounts.  Balances presented in the table should exclude asset retirement obligations (AROs) and the related depreciation and accretion expense. These should be disclosed separately consistent with the Notes of historical Audited Financial Statements."]
[]
[]
["Notes:"]
[1,"This is the net book value of assets that existed as at the date of the utility's change in depreciation policies (i.e. as at Jan. 1, 2012 or Jan. 1, 2013).  These assets are to be depreciated at the average remaining service life. This amount will not change in years subsequent to the date of the utility's change in depreciation policies.  This column is expected to be used until the assets that existed as at the date of the utility's change in depreciation policies are fully depreciated."]
[2,"This is the opening gross book value of assets that have been acquired after the date of the utilities change in depreciation policies (i.e. additions starting in 2012/2013 for those who changed policies Jan. 1, 2012/2013). These assets are to be depreciated at the revised service life. The amount is expected to be equal to the gross book value of the prior year plus the prior year's additions."]
[3,"A recalculation should be performed to determine the average remaining life of opening balance of assets (i.e. excluding current year's additions) under the change in policies under CGAAP.  For example, Asset A had a useful life of 20 years under CGAAP without the change in policies.  On January 1 of the year of policy changes, Asset A was 3 years depreciated. As a result, Asset A would have a remaining service life of 17 years (20 years less 3 years) as at January 1 of the year of policy changes.  Due to making the change in policies under CGAAP, management re-assessed the asset useful lives and concluded that the revised useful life of Asset A is now 30 years. Therefore, the average remaining useful life of the opening balance of Asset A is determined to be 27 years (30 years less 3 years) under the revised CGAAP as at January 1 of the year of policy changes."]
[4,"The useful life used should be consistent with the OEB's regulatory accounting policies as set out in the  Accounting Procedures Handbook for Electricity Distributors, effective Jan. 1, 2012 and also with the Report of the Board, Transition to International Financial Reporting Standards, EB-2008-0408, and the Kinectrics Report."]
[5,"Board policy of the \"half-year\" rule - the applicant must ensure that additions in the year attract a half-year depreciation expense in the first year.  Deviations from this standard practice must be supported in the application."]
[6,"The applicant must provide an explanation of material variances in evidence."]
[7,"This should include assets in column a (excel column C) that become fully depreciated since the date of the policy change.  The amount input in b (excel column D) should equal the net book value of the asset as at the date of depreciation policy change"]
[8,"This should include assets in column d (excel column f) that have become fully depreciated.  The amount input in e (excel column G) should equal the gross book value of the asset"]
[]
[]
[]
["Scenario that applies",null,"Applicable Years and Accounting Standard",null,null,null,null,null,null,null,null,null,null,null,null,null,null,"Year Reflected in Schedule Below","Accounting Standard Reflected in Schedule Below"]
["Rebasing for the first time with depreciation policy changes made in 2012.",null,"This appendix must be duplicated and completed for the years 2012 to 2018. The appendix for 2012 is to be completed under CGAAP (prior to changes in depreciation policies). The appendix for 2012 to 2014 must be completed under Revised CGAAP (after changes in depreciation policies). The appendix for 2014 to 2018 is to be completed under MIFRS (2014 if changes to MIFRS are material)."]
["Rebasing for the first time with depreciation policy changes made in 2013.",null,"This appendix must be duplicated and completed for the years 2013 to 2018. The appendix for 2013 is to be completed under CGAAP (prior to changes in depreciation policies). The appendix for 2013 to 2014 must be completed under Revised CGAAP (after changes in depreciation policies). The appendix for 2014 to 2018 is to be completed under MIFRS (2014 if changes to MIFRS are material).",null,null,null,null,null,null,null,null,null,null,null,null,null,null,2016,"MIFRS"]
["Already rebased with depreciation policy changes in a prior rate application",null,"This appendix must be completed for 2014 to 2018. The appendix for 2014 is to be completed under Revised CGAAP (after changes in depreciation policies). The appendix for 2014 to 2018 is to be completed under MIFRS (2014 if changes to MIFRS are material)."]
[]
[]
[null,null,"Book Values",null,null,null,null,null,null,"Service Lives",null,null,null,"Depreciation Expense"]
["Account","Description","Opening Net  Book Value of Existing Assets as at Date of Policy Change (Jan. 1) 1","Less Fully Depreciated 7","Net Amount of Existing Assets Before Policy Change to be Depreciated ","Opening Gross Book Value of Assets Acquired After Policy Change 2","Less Fully Depreciated 8","Net Amount of Assets Acquired After Policy Change to be Depreciated ","Current Year Additions","Average Remaining Life of Assets Existing Before Policy Change 3","Depreciation Rate Assets Acquired After Policy Change","Life of Assets Acquired After Policy Change 4","Depreciation Rate on New Additions","Depreciation Expense on Assets Existing Before Policy Change","Depreciation Expense on Assets Acquired After Policy Change","Depreciation Expense on Current Year Additions 5","Total Current Year Depreciation Expense ","Depreciation Expense per Appendix 2-BA Fixed Assets, Column J \n ","Variance 6"]
[null,null,"a","b","c = a-b","d","e","f = d- e","g","h","i = 1/h","j","k = 1/j","l = c/h","m = f/j","n = g*0.5/j","o = l+m+n","p","q = p-o"]
[1611,"Computer Software (Formally known as Account 1925)",{"$f":"'App.2-BA_Fixed Asset Cont'!M412","v":425683.57999999996},{"$f":"7586.79333333333+1618.58","v":9205.3733333333294},{"$f":"C359-D359","v":416478.20666666661},{"$f":"I359","v":27000.43},null,{"$f":"F359-G359","v":27000.43},{"$f":"'App.2-BA_Fixed Asset Cont'!E500","v":27000.43},{"$f":"C359/'App.2-BA_Fixed Asset Cont'!D500*'App.2-C_DepExp'!L359","v":0.88312937301529826},{"$f":"IF(J359=0,0,1/J359)","v":1.1323369265656587},3,{"$f":"IF(L359=0,0,1/L359)","v":0.33333333333333331},{"$f":"IF(J359=0,0,+E359/J359)","v":471593.65251851047},{"$f":"IF(L359=0,0,+H359/L359)","v":9000.1433333333334},{"$f":"IF(L359=0,0,+(I359*0.5)/L359)","v":4500.0716666666667},{"$f":"IF(ISERROR(+N359+O359+P359), 0, +N359+O359+P359)","v":485093.86751851044},{"$f":"-'App.2-BA_Fixed Asset Cont'!L500","v":1107800.3600000001},{"$f":"IF(ISERROR(+R359-122), 0, +R359-Q359)","v":622706.49248148967}]
[1612,"Land Rights (Formally known as Account 1906)",{"$f":"'App.2-BA_Fixed Asset Cont'!M413","v":43879.040000000001},null,{"$f":"C360-D360","v":43879.040000000001},{"$f":"I360","v":1800},null,{"$f":"F360-G360","v":1800},{"$f":"'App.2-BA_Fixed Asset Cont'!E501","v":1800},{"$f":"C360/'App.2-BA_Fixed Asset Cont'!D501*'App.2-C_DepExp'!L360","v":0},{"$f":"IF(J360=0,0,1/J360)","v":0},null,{"$f":"IF(L360=0,0,1/L360)","v":0},{"$f":"IF(J360=0,0,+E360/J360)","v":0},{"$f":"IF(L360=0,0,+H360/L360)","v":0},{"$f":"IF(L360=0,0,+(I360*0.5)/L360)","v":0},{"$f":"IF(ISERROR(+N360+O360+P360), 0, +N360+O360+P360)","v":0},{"$f":"-'App.2-BA_Fixed Asset Cont'!L501","v":0},{"$f":"IF(ISERROR(+R360-122), 0, +R360-Q360)","v":0}]
[1805,"Land",{"$f":"'App.2-BA_Fixed Asset Cont'!M414","v":104039.08},null,104039.08,74505,null,74505,{"$f":"'App.2-BA_Fixed Asset Cont'!E502","v":74505},{"$f":"C361/'App.2-BA_Fixed Asset Cont'!D502*'App.2-C_DepExp'!L361","v":0},0,null,0,0,{"$f":"IF(L361=0,0,+H361/L361)","v":0},0,0,{"$f":"-'App.2-BA_Fixed Asset Cont'!L502","v":0},0]
[1808,"Buildings",{"$f":"'App.2-BA_Fixed Asset Cont'!M415","v":169948.46000000002},null,169948.46000000002,3193.5,null,3193.5,{"$f":"'App.2-BA_Fixed Asset Cont'!E503","v":3193.5},{"$f":"C362/'App.2-BA_Fixed Asset Cont'!D503*'App.2-C_DepExp'!L362","v":40.26108466169071},2.4837880260874381E-2,60,1.6666666666666666E-2,4221.1594999999998,53.225000000000001,26.612500000000001,4300.9970000000003,{"$f":"-'App.2-BA_Fixed Asset Cont'!L503","v":87842.81},83541.812999999995]
[1810,"Leasehold Improvements",{"$f":"'App.2-BA_Fixed Asset Cont'!M416","v":0},null,0,0,null,0,{"$f":"'App.2-BA_Fixed Asset Cont'!E504","v":0},null,0,null,0,0,0,0,0,{"$f":"-'App.2-BA_Fixed Asset Cont'!L504","v":0},0]
[1815,"Transformer Station Equipment >50 kV",{"$f":"'App.2-BA_Fixed Asset Cont'!M417","v":0},null,0,0,null,0,{"$f":"'App.2-BA_Fixed Asset Cont'!E505","v":0},null,0,null,0,0,0,0,0,{"$f":"-'App.2-BA_Fixed Asset Cont'!L505","v":0},0]
[1820,"Distribution Station Equipment <50 kV",{"$f":"'App.2-BA_Fixed Asset Cont'!M418","v":364371.58000000007},null,364371.58000000007,0,null,0,{"$f":"'App.2-BA_Fixed Asset Cont'!E506","v":0},{"$f":"C365/'App.2-BA_Fixed Asset Cont'!D506*'App.2-C_DepExp'!L365","v":38.612495242604524},2.5898352171154507E-2,60,1.6666666666666666E-2,9436.6234999999997,0,0,9436.6234999999997,{"$f":"-'App.2-BA_Fixed Asset Cont'!L506","v":211553.47999999998},202116.85649999999]
[1825,"Storage Battery Equipment",{"$f":"'App.2-BA_Fixed Asset Cont'!M419","v":0},null,0,0,null,0,{"$f":"'App.2-BA_Fixed Asset Cont'!E507","v":0},null,0,null,0,0,0,0,0,{"$f":"-'App.2-BA_Fixed Asset Cont'!L507","v":0},0]
[1830,"Poles, Towers & Fixtures",{"$f":"'App.2-BA_Fixed Asset Cont'!M420","v":5645688.7300000004},null,5645688.7300000004,548836.86,null,548836.86,{"$f":"'App.2-BA_Fixed Asset Cont'!E508","v":548836.86},{"$f":"C367/'App.2-BA_Fixed Asset Cont'!D508*'App.2-C_DepExp'!L367","v":33.646364339453548},2.9720893167271726E-2,50,0.02,167794.91159999999,10976.7372,5488.3685999999998,184260.01739999998,{"$f":"-'App.2-BA_Fixed Asset Cont'!L508","v":2839763.0299999993},2655503.0125999996]
[1835,"Overhead Conductors & Devices",{"$f":"'App.2-BA_Fixed Asset Cont'!M421","v":6860376.4200000009},null,6860376.4200000009,887130.6,null,887130.6,{"$f":"'App.2-BA_Fixed Asset Cont'!E509","v":887130.6},{"$f":"C368/'App.2-BA_Fixed Asset Cont'!D509*'App.2-C_DepExp'!L368","v":28.732868079162206},3.4803347763435598E-2,60,1.6666666666666666E-2,238764.06633333335,14785.51,7392.7550000000001,260942.33133333336,{"$f":"-'App.2-BA_Fixed Asset Cont'!L509","v":7371260.21},7110317.8786666663]
[1840,"Underground Conduit",{"$f":"'App.2-BA_Fixed Asset Cont'!M422","v":2386731.34},null,2386731.34,221002.74,null,221002.74,{"$f":"'App.2-BA_Fixed Asset Cont'!E510","v":221002.74},{"$f":"C369/'App.2-BA_Fixed Asset Cont'!D510*'App.2-C_DepExp'!L369","v":37.331066615778681},2.6787340696483905E-2,45,2.2222222222222223E-2,63934.185555555559,4911.1719999999996,2455.5859999999998,71300.943555555554,{"$f":"-'App.2-BA_Fixed Asset Cont'!L510","v":562391.71},491090.76644444442]
[1845,"Underground Conductors & Devices",{"$f":"'App.2-BA_Fixed Asset Cont'!M423","v":5734023.2399999993},null,5734023.2399999993,659041.52,null,659041.52,{"$f":"'App.2-BA_Fixed Asset Cont'!E511","v":659041.52},{"$f":"C370/'App.2-BA_Fixed Asset Cont'!D511*'App.2-C_DepExp'!L370","v":36.769487738829881},2.7196462651394641E-2,45,2.2222222222222223E-2,155945.14888888886,14645.367111111111,7322.6835555555554,177913.19955555553,{"$f":"-'App.2-BA_Fixed Asset Cont'!L511","v":1208589.4199999997},1030676.2204444441]
[1850,"Line Transformers",{"$f":"'App.2-BA_Fixed Asset Cont'!M424","v":7410622.0699999994},null,7410622.0699999994,535550.79,null,535550.79,{"$f":"'App.2-BA_Fixed Asset Cont'!E512","v":535550.79},{"$f":"C371/'App.2-BA_Fixed Asset Cont'!D512*'App.2-C_DepExp'!L371","v":33.312906706093791},3.0018395237095121E-2,40,2.5000000000000001E-2,222454.98224999997,13388.769750000001,6694.3848750000006,242538.13687499997,{"$f":"-'App.2-BA_Fixed Asset Cont'!L512","v":1529178.7200000002},1286640.5831250004]
[1855,"Services (Overhead & Underground)",{"$f":"'App.2-BA_Fixed Asset Cont'!M425","v":3696187.1000000006},null,3696187.1000000006,591580.52,null,591580.52,{"$f":"'App.2-BA_Fixed Asset Cont'!E513","v":591580.52},{"$f":"C372/'App.2-BA_Fixed Asset Cont'!D513*'App.2-C_DepExp'!L372","v":41.522460092908766},2.4083351462375918E-2,60,1.6666666666666666E-2,89016.573000000019,9859.6753333333345,4929.8376666666672,103806.08600000002,{"$f":"-'App.2-BA_Fixed Asset Cont'!L513","v":1738753.4},1634947.3139999998]
[1860,"Meters",{"$f":"'App.2-BA_Fixed Asset Cont'!M426","v":0},null,0,0,null,0,{"$f":"'App.2-BA_Fixed Asset Cont'!E514","v":0},null,0,25,0.04,0,0,0,0,{"$f":"-'App.2-BA_Fixed Asset Cont'!L514","v":0},0]
[1860,"Meters (Smart Meters)",{"$f":"'App.2-BA_Fixed Asset Cont'!M427","v":3349248.84},null,3349248.84,246045.7,null,246045.7,{"$f":"'App.2-BA_Fixed Asset Cont'!E515","v":246045.7},{"$f":"C374/'App.2-BA_Fixed Asset Cont'!D515*'App.2-C_DepExp'!L374","v":7.8296525566951169},0.12771958816293866,12,8.3333333333333329E-2,427764.6825,20503.808333333334,10251.904166666667,458520.39500000002,{"$f":"-'App.2-BA_Fixed Asset Cont'!L515","v":2124960.8199999998},1666440.4249999998]
[1905,"Land",{"$f":"'App.2-BA_Fixed Asset Cont'!M428","v":0},null,0,0,null,0,{"$f":"'App.2-BA_Fixed Asset Cont'!E516","v":0},null,0,null,0,0,0,0,0,{"$f":"-'App.2-BA_Fixed Asset Cont'!L516","v":0},0]
[1908,"Buildings & Fixtures",{"$f":"'App.2-BA_Fixed Asset Cont'!M429","v":0},null,0,0,null,0,{"$f":"'App.2-BA_Fixed Asset Cont'!E517","v":0},null,0,null,0,0,0,0,0,{"$f":"-'App.2-BA_Fixed Asset Cont'!L517","v":0},0]
[1910,"Leasehold Improvements",{"$f":"'App.2-BA_Fixed Asset Cont'!M430","v":386549.98},null,386549.98,41813.15,null,41813.15,{"$f":"'App.2-BA_Fixed Asset Cont'!E518","v":41813.15},{"$f":"C377/'App.2-BA_Fixed Asset Cont'!D518*'App.2-C_DepExp'!L377","v":51.250155032314581},1.9512136097334213E-2,55,1.8181818181818181E-2,7542.4158181818175,760.23909090909092,380.11954545454546,8682.7744545454534,{"$f":"-'App.2-BA_Fixed Asset Cont'!L518","v":36205.43},27522.655545454545]
[1915,"Office Furniture & Equipment (10 years)",{"$f":"'App.2-BA_Fixed Asset Cont'!M431","v":22854.829999999987},null,22854.829999999987,0,null,0,{"$f":"'App.2-BA_Fixed Asset Cont'!E519","v":0},{"$f":"C378/'App.2-BA_Fixed Asset Cont'!D519*'App.2-C_DepExp'!L378","v":2.339060346773008},0.42752210364286258,10,0.1,9770.9449999999997,0,0,9770.9449999999997,{"$f":"-'App.2-BA_Fixed Asset Cont'!L519","v":78965.12000000001},69194.175000000017]
[1915,"Office Furniture & Equipment (5 years)",{"$f":"'App.2-BA_Fixed Asset Cont'!M432","v":0},null,0,0,null,0,{"$f":"'App.2-BA_Fixed Asset Cont'!E520","v":0},null,0,null,0,0,0,0,0,{"$f":"-'App.2-BA_Fixed Asset Cont'!L520","v":0},0]
[1920,"Computer Equipment - Hardware",{"$f":"'App.2-BA_Fixed Asset Cont'!M433","v":0},null,0,0,null,0,{"$f":"'App.2-BA_Fixed Asset Cont'!E521","v":0},{"$f":"C380/'App.2-BA_Fixed Asset Cont'!D521*'App.2-C_DepExp'!L380","v":0},0,null,0,0,0,0,0,{"$f":"-'App.2-BA_Fixed Asset Cont'!L521","v":97941},97941]
[1920,"Computer Equip.-Hardware(Post Mar. 22/04)",{"$f":"'App.2-BA_Fixed Asset Cont'!M434","v":0},null,0,0,null,0,{"$f":"'App.2-BA_Fixed Asset Cont'!E522","v":0},{"$f":"C381/'App.2-BA_Fixed Asset Cont'!D522*'App.2-C_DepExp'!L381","v":0},0,null,0,0,0,0,0,{"$f":"-'App.2-BA_Fixed Asset Cont'!L522","v":3892},3892]
[1920,"Computer Equip.-Hardware(Post Mar. 19/07)",{"$f":"'App.2-BA_Fixed Asset Cont'!M435","v":76488.069999999992},null,76488.069999999992,22003.13,null,22003.13,{"$f":"'App.2-BA_Fixed Asset Cont'!E523","v":22003.13},{"$f":"C382/'App.2-BA_Fixed Asset Cont'!D523*'App.2-C_DepExp'!L382","v":2.5748499385777257},0.38837214744730786,5,0.2,29705.835999999999,4400.6260000000002,2200.3130000000001,36306.775000000001,{"$f":"-'App.2-BA_Fixed Asset Cont'!L523","v":103947.11},67640.334999999992]
[1930,"Transportation Equipment",{"$f":"'App.2-BA_Fixed Asset Cont'!M436","v":1014952.4600000009},{"$f":"623.35+2390.46+3778.48","v":6792.29},1008160.1700000009,346258.45,null,346258.45,{"$f":"'App.2-BA_Fixed Asset Cont'!E524","v":346258.45},{"$f":"C383/'App.2-BA_Fixed Asset Cont'!D524*'App.2-C_DepExp'!L383","v":2.5421500328002824},0.39336781350330413,8,0.125,396577.76173401973,43282.306250000001,21641.153125000001,461501.22110901977,{"$f":"-'App.2-BA_Fixed Asset Cont'!L524","v":1841558.3000000003},1380057.0788909805]
[1935,"Stores Equipment",{"$f":"'App.2-BA_Fixed Asset Cont'!M437","v":0},null,0,0,null,0,{"$f":"'App.2-BA_Fixed Asset Cont'!E525","v":0},null,0,null,0,0,0,0,0,{"$f":"-'App.2-BA_Fixed Asset Cont'!L525","v":0},0]
[1940,"Tools, Shop & Garage Equipment",{"$f":"'App.2-BA_Fixed Asset Cont'!M438","v":73160.339999999967},null,73160.339999999967,15489.42,null,15489.42,{"$f":"'App.2-BA_Fixed Asset Cont'!E526","v":15489.42},{"$f":"C385/'App.2-BA_Fixed Asset Cont'!D526*'App.2-C_DepExp'!L385","v":3.2046590164037818},0.31204567939405431,10,0.1,22829.367999999999,1548.942,774.471,25152.780999999999,{"$f":"-'App.2-BA_Fixed Asset Cont'!L526","v":171875.9},146723.11900000001]
[1945,"Measurement & Testing Equipment",{"$f":"'App.2-BA_Fixed Asset Cont'!M439","v":21158.850000000002},null,21158.850000000002,0,null,0,{"$f":"'App.2-BA_Fixed Asset Cont'!E527","v":0},{"$f":"C386/'App.2-BA_Fixed Asset Cont'!D527*'App.2-C_DepExp'!L386","v":5.4459219641388685},0.18362363739050089,8,0.125,3885.2650000000003,0,0,3885.2650000000003,{"$f":"-'App.2-BA_Fixed Asset Cont'!L527","v":13808.54},9923.2750000000015]
[1950,"Power Operated Equipment",{"$f":"'App.2-BA_Fixed Asset Cont'!M440","v":196824.93},null,196824.93,1573.8,null,1573.8,{"$f":"'App.2-BA_Fixed Asset Cont'!E528","v":1573.8},{"$f":"C387/'App.2-BA_Fixed Asset Cont'!D528*'App.2-C_DepExp'!L387","v":7.0582756204267261},0.1416776637492009,8,0.125,27885.696250000001,196.72499999999999,98.362499999999997,28180.783749999999,{"$f":"-'App.2-BA_Fixed Asset Cont'!L528","v":53925.7},25744.916249999998]
[1955,"Communications Equipment",{"$f":"'App.2-BA_Fixed Asset Cont'!M441","v":0},null,0,31915.4,null,31915.4,{"$f":"'App.2-BA_Fixed Asset Cont'!E529","v":31915.4},null,0,null,0,0,0,0,0,{"$f":"-'App.2-BA_Fixed Asset Cont'!L529","v":3191.54},3191.54]
[1955,"Communication Equipment (Smart Meters)",{"$f":"'App.2-BA_Fixed Asset Cont'!M442","v":0},null,0,0,null,0,{"$f":"'App.2-BA_Fixed Asset Cont'!E530","v":0},null,0,null,0,0,0,0,0,{"$f":"-'App.2-BA_Fixed Asset Cont'!L530","v":0},0]
[1960,"Miscellaneous Equipment ",{"$f":"'App.2-BA_Fixed Asset Cont'!M443","v":0},null,0,0,null,0,{"$f":"'App.2-BA_Fixed Asset Cont'!E531","v":0},null,0,null,0,0,0,0,0,{"$f":"-'App.2-BA_Fixed Asset Cont'!L531","v":0},0]
[1970,"Load Management Controls Customer Premises",{"$f":"'App.2-BA_Fixed Asset Cont'!M444","v":0},null,0,0,null,0,{"$f":"'App.2-BA_Fixed Asset Cont'!E532","v":0},null,0,null,0,0,0,0,0,{"$f":"-'App.2-BA_Fixed Asset Cont'!L532","v":0},0]
[1975,"Load Management Controls Utility Premises",{"$f":"'App.2-BA_Fixed Asset Cont'!M445","v":0},null,0,0,null,0,{"$f":"'App.2-BA_Fixed Asset Cont'!E533","v":0},null,0,null,0,0,0,0,0,{"$f":"-'App.2-BA_Fixed Asset Cont'!L533","v":0},0]
[1980,"System Supervisor Equipment",{"$f":"'App.2-BA_Fixed Asset Cont'!M446","v":208125.65},null,208125.65,188030.44,null,188030.44,{"$f":"'App.2-BA_Fixed Asset Cont'!E534","v":188030.44},{"$f":"C393/'App.2-BA_Fixed Asset Cont'!D534*'App.2-C_DepExp'!L393","v":3.2091511985419512},0.3116088766569618,5,0.2,64853.8,37606.088000000003,18803.044000000002,121262.932,{"$f":"-'App.2-BA_Fixed Asset Cont'!L534","v":199800.19},78537.258000000002]
[1985,"Miscellaneous Fixed Assets",{"$f":"'App.2-BA_Fixed Asset Cont'!M447","v":0},null,0,0,null,0,{"$f":"'App.2-BA_Fixed Asset Cont'!E535","v":0},null,0,null,0,0,0,0,0,{"$f":"-'App.2-BA_Fixed Asset Cont'!L535","v":0},0]
[1990,"Other Tangible Property",{"$f":"'App.2-BA_Fixed Asset Cont'!M448","v":0},null,0,0,null,0,{"$f":"'App.2-BA_Fixed Asset Cont'!E536","v":0},null,0,null,0,0,0,0,0,{"$f":"-'App.2-BA_Fixed Asset Cont'!L536","v":0},0]
[1995,"Contributions & Grants",{"$f":"'App.2-BA_Fixed Asset Cont'!M449","v":-5692734.9699999997},null,-5692734.9699999997,0,null,0,{"$f":"'App.2-BA_Fixed Asset Cont'!E537","v":0},{"$f":"C396/'App.2-BA_Fixed Asset Cont'!D537*'App.2-C_DepExp'!L396","v":20.958655008072526},4.771298538073343E-2,25,0.04,-271617.38039999997,0,0,-271617.38039999997,{"$f":"-'App.2-BA_Fixed Asset Cont'!L537","v":-1310532.27},-1038914.8896000001]
[2440,"Deferred Revenue",{"$f":"'App.2-BA_Fixed Asset Cont'!M450","v":-1353168.56},null,null,{"$f":"I397","v":-1192750.71},null,-1192750.71,{"$f":"'App.2-BA_Fixed Asset Cont'!E538","v":-1192750.71},{"$f":"C397/'App.2-BA_Fixed Asset Cont'!D538*'App.2-C_DepExp'!L397","v":54.907725360070998},1.8212373458238389E-2,60,1.6666666666666666E-2,0,-19879.178499999998,-9939.5892499999991,-29818.767749999999,{"$f":"-'App.2-BA_Fixed Asset Cont'!L538","v":-136339.29827272726},-106520.53052272726]
[null,"Total",{"$f":"SUM(C359:C397)","v":31145011.060000006},15997.66333333333,32482181.956666671,3250020.7400000012,0,3250020.7400000012,3250020.7400000012,null,null,null,null,{"$f":"SUM(N359:N397)","v":2142359.6930484888},166040.1559020202,83020.077951010098,2391419.9269015198,19940333.221727271,17548913.294825751]
[]
[]
["General:","Applicants are to complete this appendix to show the reasonability of the depreciation expense that is included in rate base via. Accumulated depreciation and the revenue requirement."]
[null,"Applicants must provide a breakdown of depreciation and amortization expense in the above format for all relevant accounts.  Balances presented in the table should exclude asset retirement obligations (AROs) and the related depreciation and accretion expense. These should be disclosed separately consistent with the Notes of historical Audited Financial Statements."]
[]
[]
["Notes:"]
[1,"This is the net book value of assets that existed as at the date of the utility's change in depreciation policies (i.e. as at Jan. 1, 2012 or Jan. 1, 2013).  These assets are to be depreciated at the average remaining service life. This amount will not change in years subsequent to the date of the utility's change in depreciation policies.  This column is expected to be used until the assets that existed as at the date of the utility's change in depreciation policies are fully depreciated."]
[2,"This is the opening gross book value of assets that have been acquired after the date of the utilities change in depreciation policies (i.e. additions starting in 2012/2013 for those who changed policies Jan. 1, 2012/2013). These assets are to be depreciated at the revised service life. The amount is expected to be equal to the gross book value of the prior year plus the prior year's additions."]
[3,"A recalculation should be performed to determine the average remaining life of opening balance of assets (i.e. excluding current year's additions) under the change in policies under CGAAP.  For example, Asset A had a useful life of 20 years under CGAAP without the change in policies.  On January 1 of the year of policy changes, Asset A was 3 years depreciated. As a result, Asset A would have a remaining service life of 17 years (20 years less 3 years) as at January 1 of the year of policy changes.  Due to making the change in policies under CGAAP, management re-assessed the asset useful lives and concluded that the revised useful life of Asset A is now 30 years. Therefore, the average remaining useful life of the opening balance of Asset A is determined to be 27 years (30 years less 3 years) under the revised CGAAP as at January 1 of the year of policy changes."]
[4,"The useful life used should be consistent with the OEB's regulatory accounting policies as set out in the  Accounting Procedures Handbook for Electricity Distributors, effective Jan. 1, 2012 and also with the Report of the Board, Transition to International Financial Reporting Standards, EB-2008-0408, and the Kinectrics Report."]
[5,"Board policy of the \"half-year\" rule - the applicant must ensure that additions in the year attract a half-year depreciation expense in the first year.  Deviations from this standard practice must be supported in the application."]
[6,"The applicant must provide an explanation of material variances in evidence."]
[7,"This should include assets in column a (excel column C) that become fully depreciated since the date of the policy change.  The amount input in b (excel column D) should equal the net book value of the asset as at the date of depreciation policy change"]
[8,"This should include assets in column d (excel column f) that have become fully depreciated.  The amount input in e (excel column G) should equal the gross book value of the asset"]
[]
[]
[]
["Scenario that applies",null,"Applicable Years and Accounting Standard",null,null,null,null,null,null,null,null,null,null,null,null,null,null,"Year Reflected in Schedule Below","Accounting Standard Reflected in Schedule Below"]
["Rebasing for the first time with depreciation policy changes made in 2012.",null,"This appendix must be duplicated and completed for the years 2012 to 2018. The appendix for 2012 is to be completed under CGAAP (prior to changes in depreciation policies). The appendix for 2012 to 2014 must be completed under Revised CGAAP (after changes in depreciation policies). The appendix for 2014 to 2018 is to be completed under MIFRS (2014 if changes to MIFRS are material)."]
["Rebasing for the first time with depreciation policy changes made in 2013.",null,"This appendix must be duplicated and completed for the years 2013 to 2018. The appendix for 2013 is to be completed under CGAAP (prior to changes in depreciation policies). The appendix for 2013 to 2014 must be completed under Revised CGAAP (after changes in depreciation policies). The appendix for 2014 to 2018 is to be completed under MIFRS (2014 if changes to MIFRS are material).",null,null,null,null,null,null,null,null,null,null,null,null,null,null,2017,"MIFRS"]
["Already rebased with depreciation policy changes in a prior rate application",null,"This appendix must be completed for 2014 to 2018. The appendix for 2014 is to be completed under Revised CGAAP (after changes in depreciation policies). The appendix for 2014 to 2018 is to be completed under MIFRS (2014 if changes to MIFRS are material)."]
[]
[]
[null,null,"Book Values",null,null,null,null,null,null,"Service Lives",null,null,null,"Depreciation Expense"]
["Account","Description","Opening Net  Book Value of Existing Assets as at Date of Policy Change (Jan. 1) 1","Less Fully Depreciated 7","Net Amount of Existing Assets Before Policy Change to be Depreciated ","Opening Gross Book Value of Assets Acquired After Policy Change 2","Less Fully Depreciated 8","Net Amount of Assets Acquired After Policy Change to be Depreciated ","Current Year Additions","Average Remaining Life of Assets Existing Before Policy Change 3","Depreciation Rate Assets Acquired After Policy Change","Life of Assets Acquired After Policy Change 4","Depreciation Rate on New Additions","Depreciation Expense on Assets Existing Before Policy Change","Depreciation Expense on Assets Acquired After Policy Change","Depreciation Expense on Current Year Additions 5","Total Current Year Depreciation Expense ","Depreciation Expense per Appendix 2-BA Fixed Assets, Column J \n ","Variance 6"]
[null,null,"a","b","c = a-b","d","e","f = d- e","g","h","i = 1/h","j","k = 1/j","l = c/h","m = f/j","n = g*0.5/j","o = l+m+n","p","q = p-o"]
[1611,"Computer Software (Formally known as Account 1925)",{"$f":"'App.2-BA_Fixed Asset Cont'!M500","v":365251.7799999998},null,{"$f":"C426-D426","v":365251.7799999998},{"$f":"I426","v":35000},null,{"$f":"F426-G426","v":35000},{"$f":"'App.2-BA_Fixed Asset Cont'!E590","v":35000},{"$f":"C426/'App.2-BA_Fixed Asset Cont'!D590*'App.2-C_DepExp'!L426","v":0.74386731483924218},{"$f":"IF(J426=0,0,1/J426)","v":1.3443257689257537},3,{"$f":"IF(L426=0,0,1/L426)","v":0.33333333333333331},{"$f":"IF(J426=0,0,+E426/J426)","v":491017.37999999995},{"$f":"IF(L426=0,0,+H426/L426)","v":11666.666666666666},{"$f":"IF(L426=0,0,+(I426*0.5)/L426)","v":5833.333333333333},{"$f":"IF(ISERROR(+N426+O426+P426), 0, +N426+O426+P426)","v":508517.37999999995},{"$f":"-'App.2-BA_Fixed Asset Cont'!L590","v":1252687.8833333335},{"$f":"IF(ISERROR(+R426-122), 0, +R426-Q426)","v":744170.50333333365}]
[1612,"Land Rights (Formally known as Account 1906)",{"$f":"'App.2-BA_Fixed Asset Cont'!M501","v":45679.040000000001},null,{"$f":"C427-D427","v":45679.040000000001},{"$f":"I427","v":0},null,{"$f":"F427-G427","v":0},{"$f":"'App.2-BA_Fixed Asset Cont'!E591","v":0},{"$f":"C427/'App.2-BA_Fixed Asset Cont'!D591*'App.2-C_DepExp'!L427","v":0},{"$f":"IF(J427=0,0,1/J427)","v":0},null,{"$f":"IF(L427=0,0,1/L427)","v":0},{"$f":"IF(J427=0,0,+E427/J427)","v":0},{"$f":"IF(L427=0,0,+H427/L427)","v":0},{"$f":"IF(L427=0,0,+(I427*0.5)/L427)","v":0},{"$f":"IF(ISERROR(+N427+O427+P427), 0, +N427+O427+P427)","v":0},{"$f":"-'App.2-BA_Fixed Asset Cont'!L591","v":0},{"$f":"IF(ISERROR(+R427-122), 0, +R427-Q427)","v":0}]
[1805,"Land",{"$f":"'App.2-BA_Fixed Asset Cont'!M502","v":178544.08000000002},null,178544.08000000002,0,null,0,{"$f":"'App.2-BA_Fixed Asset Cont'!E592","v":0},{"$f":"C428/'App.2-BA_Fixed Asset Cont'!D592*'App.2-C_DepExp'!L428","v":0},0,null,0,0,{"$f":"IF(L428=0,0,+H428/L428)","v":0},0,0,{"$f":"-'App.2-BA_Fixed Asset Cont'!L592","v":0},0]
[1808,"Buildings",{"$f":"'App.2-BA_Fixed Asset Cont'!M503","v":168620.26},null,168620.26,748343,null,748343,{"$f":"'App.2-BA_Fixed Asset Cont'!E593","v":748343},{"$f":"C429/'App.2-BA_Fixed Asset Cont'!D593*'App.2-C_DepExp'!L429","v":39.449015407949382},2.534917512284704E-2,60,1.6666666666666666E-2,4274.3845000000001,12472.383333333333,6236.1916666666666,22982.959499999997,{"$f":"-'App.2-BA_Fixed Asset Cont'!L593","v":99167.628181818174},76184.668681818177]
[1810,"Leasehold Improvements",{"$f":"'App.2-BA_Fixed Asset Cont'!M504","v":0},null,0,0,null,0,{"$f":"'App.2-BA_Fixed Asset Cont'!E594","v":0},null,0,null,0,0,0,0,0,{"$f":"-'App.2-BA_Fixed Asset Cont'!L594","v":0},0]
[1815,"Transformer Station Equipment >50 kV",{"$f":"'App.2-BA_Fixed Asset Cont'!M505","v":0},null,0,0,null,0,{"$f":"'App.2-BA_Fixed Asset Cont'!E595","v":0},null,0,null,0,0,0,0,0,{"$f":"-'App.2-BA_Fixed Asset Cont'!L595","v":0},0]
[1820,"Distribution Station Equipment <50 kV",{"$f":"'App.2-BA_Fixed Asset Cont'!M506","v":354643.93000000005},null,354643.93000000005,0,null,0,{"$f":"'App.2-BA_Fixed Asset Cont'!E596","v":0},{"$f":"C432/'App.2-BA_Fixed Asset Cont'!D596*'App.2-C_DepExp'!L432","v":37.581655133321789},2.6608726956076759E-2,60,1.6666666666666666E-2,9436.6235000000015,0,0,9436.6235000000015,{"$f":"-'App.2-BA_Fixed Asset Cont'!L596","v":221281.12999999998},211844.50649999996]
[1825,"Storage Battery Equipment",{"$f":"'App.2-BA_Fixed Asset Cont'!M507","v":0},null,0,0,null,0,{"$f":"'App.2-BA_Fixed Asset Cont'!E597","v":0},null,0,null,0,0,0,0,0,{"$f":"-'App.2-BA_Fixed Asset Cont'!L597","v":0},0]
[1830,"Poles, Towers & Fixtures",{"$f":"'App.2-BA_Fixed Asset Cont'!M508","v":6021242.3100000005},null,6021242.3100000005,360362.57211924688,null,360362.57211924688,{"$f":"'App.2-BA_Fixed Asset Cont'!E598","v":360362.57211924688},{"$f":"C434/'App.2-BA_Fixed Asset Cont'!D598*'App.2-C_DepExp'!L434","v":33.97606749439111},2.9432482148355855E-2,50,0.02,177220.10679999998,7207.2514423849379,3603.625721192469,188030.9839635774,{"$f":"-'App.2-BA_Fixed Asset Cont'!L598","v":3016649.9357211916},2828618.951757614]
[1835,"Overhead Conductors & Devices",{"$f":"'App.2-BA_Fixed Asset Cont'!M509","v":7501350.1900000004},null,7501350.1900000004,604844.70240387658,null,604844.70240387658,{"$f":"'App.2-BA_Fixed Asset Cont'!E599","v":604844.70240387658},{"$f":"C435/'App.2-BA_Fixed Asset Cont'!D599*'App.2-C_DepExp'!L435","v":30.262408500931354},3.3044296522837038E-2,60,1.6666666666666666E-2,247876.83999999997,10080.74504006461,5040.3725200323051,262997.95756009687,{"$f":"-'App.2-BA_Fixed Asset Cont'!L599","v":7622457.4125200324},7359459.4549599355]
[1840,"Underground Conduit",{"$f":"'App.2-BA_Fixed Asset Cont'!M510","v":2535649.38},null,2535649.38,125992.25628313584,null,125992.25628313584,{"$f":"'App.2-BA_Fixed Asset Cont'!E600","v":125992.25628313584},{"$f":"C436/'App.2-BA_Fixed Asset Cont'!D600*'App.2-C_DepExp'!L436","v":36.831087382382009},2.7150976826123947E-2,45,2.2222222222222223E-2,68845.357555555544,2799.8279174030185,1399.9139587015093,73045.09943166007,{"$f":"-'App.2-BA_Fixed Asset Cont'!L600","v":635876.32395870145},562831.22452704143]
[1845,"Underground Conductors & Devices",{"$f":"'App.2-BA_Fixed Asset Cont'!M511","v":6211542.5999999987},null,6211542.5999999987,301764.61446434277,null,301764.61446434277,{"$f":"'App.2-BA_Fixed Asset Cont'!E601","v":301764.61446434277},{"$f":"C437/'App.2-BA_Fixed Asset Cont'!D601*'App.2-C_DepExp'!L437","v":37.670410209224279},2.6546034259938373E-2,45,2.2222222222222223E-2,164891.82266666665,6705.8803214298396,3352.9401607149198,174950.64314881142,{"$f":"-'App.2-BA_Fixed Asset Cont'!L601","v":1393464.5201607146},1218513.8770119031]
[1850,"Line Transformers",{"$f":"'App.2-BA_Fixed Asset Cont'!M512","v":7717023.4999999981},null,7717023.4999999981,376027.89824454504,null,376027.89824454504,{"$f":"'App.2-BA_Fixed Asset Cont'!E602","v":376027.89824454504},{"$f":"C438/'App.2-BA_Fixed Asset Cont'!D602*'App.2-C_DepExp'!L438","v":33.38461918259884},2.9953913642999794E-2,40,2.5000000000000001E-2,231155.05549999996,9400.6974561136267,4700.3487280568133,245256.1016841704,{"$f":"-'App.2-BA_Fixed Asset Cont'!L602","v":1763028.4287280571},1517772.3270438868]
[1855,"Services (Overhead & Underground)",{"$f":"'App.2-BA_Fixed Asset Cont'!M513","v":4193821.5000000005},null,4193821.5000000005,1087500,null,1087500,{"$f":"'App.2-BA_Fixed Asset Cont'!E603","v":1087500},{"$f":"C439/'App.2-BA_Fixed Asset Cont'!D603*'App.2-C_DepExp'!L439","v":42.414852613154537},2.3576646820407908E-2,60,1.6666666666666666E-2,98876.248333333337,18125,9062.5,126063.74833333334,{"$f":"-'App.2-BA_Fixed Asset Cont'!L603","v":1841762.3099999998},1715698.5616666665]
[1860,"Meters",{"$f":"'App.2-BA_Fixed Asset Cont'!M514","v":0},null,0,0,null,0,{"$f":"'App.2-BA_Fixed Asset Cont'!E604","v":0},null,0,25,0.04,0,0,0,0,{"$f":"-'App.2-BA_Fixed Asset Cont'!L604","v":0},0]
[1860,"Meters (Smart Meters)",{"$f":"'App.2-BA_Fixed Asset Cont'!M515","v":3254261.07},null,3254261.07,248628,null,248628,{"$f":"'App.2-BA_Fixed Asset Cont'!E605","v":248628},{"$f":"C441/'App.2-BA_Fixed Asset Cont'!D605*'App.2-C_DepExp'!L441","v":7.2596248376733161},0.13774816500304118,12,8.3333333333333329E-2,448268.49083333334,20719,10359.5,479346.99083333334,{"$f":"-'App.2-BA_Fixed Asset Cont'!L605","v":2476353.79},1997006.7991666668]
[1905,"Land",{"$f":"'App.2-BA_Fixed Asset Cont'!M516","v":0},null,0,0,null,0,{"$f":"'App.2-BA_Fixed Asset Cont'!E606","v":0},null,0,null,0,0,0,0,0,{"$f":"-'App.2-BA_Fixed Asset Cont'!L606","v":0},0]
[1908,"Buildings & Fixtures",{"$f":"'App.2-BA_Fixed Asset Cont'!M517","v":0},null,0,0,null,0,{"$f":"'App.2-BA_Fixed Asset Cont'!E607","v":0},null,0,null,0,0,0,0,0,{"$f":"-'App.2-BA_Fixed Asset Cont'!L607","v":0},0]
[1910,"Leasehold Improvements",{"$f":"'App.2-BA_Fixed Asset Cont'!M518","v":420440.59},null,420440.59,49000,null,49000,{"$f":"'App.2-BA_Fixed Asset Cont'!E608","v":49000},{"$f":"C444/'App.2-BA_Fixed Asset Cont'!D608*'App.2-C_DepExp'!L444","v":50.639294852498658},1.9747510365473776E-2,55,1.8181818181818181E-2,8302.6549090909102,890.90909090909088,445.45454545454544,9639.0185454545463,{"$f":"-'App.2-BA_Fixed Asset Cont'!L608","v":44573.424545454545},34934.406000000003]
[1915,"Office Furniture & Equipment (10 years)",{"$f":"'App.2-BA_Fixed Asset Cont'!M519","v":18744.329999999987},null,18744.329999999987,0,null,0,{"$f":"'App.2-BA_Fixed Asset Cont'!E609","v":0},{"$f":"C445/'App.2-BA_Fixed Asset Cont'!D609*'App.2-C_DepExp'!L445","v":1.9183743230567756},0.5212747001359882,10,0.1,9770.9449999999997,0,0,9770.9449999999997,{"$f":"-'App.2-BA_Fixed Asset Cont'!L609","v":83075.62000000001},73304.675000000017]
[1915,"Office Furniture & Equipment (5 years)",{"$f":"'App.2-BA_Fixed Asset Cont'!M520","v":0},null,0,0,null,0,{"$f":"'App.2-BA_Fixed Asset Cont'!E610","v":0},null,0,null,0,0,0,0,0,{"$f":"-'App.2-BA_Fixed Asset Cont'!L610","v":0},0]
[1920,"Computer Equipment - Hardware",{"$f":"'App.2-BA_Fixed Asset Cont'!M521","v":0},null,0,0,null,0,{"$f":"'App.2-BA_Fixed Asset Cont'!E611","v":0},{"$f":"C447/'App.2-BA_Fixed Asset Cont'!D611*'App.2-C_DepExp'!L447","v":0},0,null,0,0,0,0,0,{"$f":"-'App.2-BA_Fixed Asset Cont'!L611","v":97941},97941]
[1920,"Computer Equip.-Hardware(Post Mar. 22/04)",{"$f":"'App.2-BA_Fixed Asset Cont'!M522","v":0},null,0,0,null,0,{"$f":"'App.2-BA_Fixed Asset Cont'!E612","v":0},{"$f":"C448/'App.2-BA_Fixed Asset Cont'!D612*'App.2-C_DepExp'!L448","v":0},0,null,0,0,0,0,0,{"$f":"-'App.2-BA_Fixed Asset Cont'!L612","v":3892},3892]
[1920,"Computer Equip.-Hardware(Post Mar. 19/07)",{"$f":"'App.2-BA_Fixed Asset Cont'!M523","v":66585.2},null,66585.2,44950,null,44950,{"$f":"'App.2-BA_Fixed Asset Cont'!E613","v":44950},{"$f":"C449/'App.2-BA_Fixed Asset Cont'!D613*'App.2-C_DepExp'!L449","v":1.9522752022769174},0.51222286634267078,5,0.2,34106.462,8990,4495,47591.462,{"$f":"-'App.2-BA_Fixed Asset Cont'!L613","v":140348.10999999999},92756.647999999986]
[1930,"Transportation Equipment",{"$f":"'App.2-BA_Fixed Asset Cont'!M524","v":1211604.6900000009},null,1211604.6900000009,135000,null,135000,{"$f":"'App.2-BA_Fixed Asset Cont'!E614","v":135000},{"$f":"C450/'App.2-BA_Fixed Asset Cont'!D614*'App.2-C_DepExp'!L450","v":3.1746872183852863},0.31499166097648551,8,0.125,381645.37375000014,16875,8437.5,406957.87375000014,{"$f":"-'App.2-BA_Fixed Asset Cont'!L614","v":2042979.3600000003},1636021.4862500001]
[1935,"Stores Equipment",{"$f":"'App.2-BA_Fixed Asset Cont'!M525","v":0},null,0,0,null,0,{"$f":"'App.2-BA_Fixed Asset Cont'!E615","v":0},null,0,null,0,0,0,0,0,{"$f":"-'App.2-BA_Fixed Asset Cont'!L615","v":0},0]
[1940,"Tools, Shop & Garage Equipment",{"$f":"'App.2-BA_Fixed Asset Cont'!M526","v":71907.199999999983},null,71907.199999999983,35000,null,35000,{"$f":"'App.2-BA_Fixed Asset Cont'!E616","v":35000},{"$f":"C452/'App.2-BA_Fixed Asset Cont'!D616*'App.2-C_DepExp'!L452","v":2.9496384285867228},0.33902460393395939,10,0.1,24378.309999999998,3500,1750,29628.309999999998,{"$f":"-'App.2-BA_Fixed Asset Cont'!L616","v":190805.96},161177.65]
[1945,"Measurement & Testing Equipment",{"$f":"'App.2-BA_Fixed Asset Cont'!M527","v":17273.580000000002},null,17273.580000000002,0,null,0,{"$f":"'App.2-BA_Fixed Asset Cont'!E617","v":0},{"$f":"C453/'App.2-BA_Fixed Asset Cont'!D617*'App.2-C_DepExp'!L453","v":4.445920677225363},0.22492529053039381,8,0.125,3885.2650000000003,0,0,3885.2650000000003,{"$f":"-'App.2-BA_Fixed Asset Cont'!L617","v":17693.810000000001},13808.545000000002]
[1950,"Power Operated Equipment",{"$f":"'App.2-BA_Fixed Asset Cont'!M528","v":170733.66999999998},null,170733.66999999998,0,null,0,{"$f":"'App.2-BA_Fixed Asset Cont'!E618","v":0},{"$f":"C454/'App.2-BA_Fixed Asset Cont'!D618*'App.2-C_DepExp'!L454","v":6.0797346667534944},0.16448086221071684,8,0.125,28082.421249999996,0,0,28082.421249999996,{"$f":"-'App.2-BA_Fixed Asset Cont'!L618","v":81590.759999999995},53508.338749999995]
[1955,"Communications Equipment",{"$f":"'App.2-BA_Fixed Asset Cont'!M529","v":28723.86},null,28723.86,0,null,0,{"$f":"'App.2-BA_Fixed Asset Cont'!E619","v":0},{"$f":"C455/'App.2-BA_Fixed Asset Cont'!D619*'App.2-C_DepExp'!L455","v":0},0,null,0,0,0,0,0,{"$f":"-'App.2-BA_Fixed Asset Cont'!L619","v":6383.08},6383.08]
[1955,"Communication Equipment (Smart Meters)",{"$f":"'App.2-BA_Fixed Asset Cont'!M530","v":0},null,0,0,null,0,{"$f":"'App.2-BA_Fixed Asset Cont'!E620","v":0},null,0,null,0,0,0,0,0,{"$f":"-'App.2-BA_Fixed Asset Cont'!L620","v":0},0]
[1960,"Miscellaneous Equipment ",{"$f":"'App.2-BA_Fixed Asset Cont'!M531","v":0},null,0,0,null,0,{"$f":"'App.2-BA_Fixed Asset Cont'!E621","v":0},null,0,null,0,0,0,0,0,{"$f":"-'App.2-BA_Fixed Asset Cont'!L621","v":0},0]
[1970,"Load Management Controls Customer Premises",{"$f":"'App.2-BA_Fixed Asset Cont'!M532","v":0},null,0,0,null,0,{"$f":"'App.2-BA_Fixed Asset Cont'!E622","v":0},null,0,null,0,0,0,0,0,{"$f":"-'App.2-BA_Fixed Asset Cont'!L622","v":0},0]
[1975,"Load Management Controls Utility Premises",{"$f":"'App.2-BA_Fixed Asset Cont'!M533","v":0},null,0,0,null,0,{"$f":"'App.2-BA_Fixed Asset Cont'!E623","v":0},null,0,null,0,0,0,0,0,{"$f":"-'App.2-BA_Fixed Asset Cont'!L623","v":0},0]
[1980,"System Supervisor Equipment",{"$f":"'App.2-BA_Fixed Asset Cont'!M534","v":312499.25},null,312499.25,50000,null,50000,{"$f":"'App.2-BA_Fixed Asset Cont'!E624","v":50000},{"$f":"C460/'App.2-BA_Fixed Asset Cont'!D624*'App.2-C_DepExp'!L460","v":3.0499667342989873},0.32787242849382836,5,0.2,102459.88800000001,10000,5000,117459.88800000001,{"$f":"-'App.2-BA_Fixed Asset Cont'!L624","v":288457.03000000003},170997.14200000002]
[1985,"Miscellaneous Fixed Assets",{"$f":"'App.2-BA_Fixed Asset Cont'!M535","v":0},null,0,0,null,0,{"$f":"'App.2-BA_Fixed Asset Cont'!E625","v":0},null,0,null,0,0,0,0,0,{"$f":"-'App.2-BA_Fixed Asset Cont'!L625","v":0},0]
[1990,"Other Tangible Property",{"$f":"'App.2-BA_Fixed Asset Cont'!M536","v":0},null,0,0,null,0,{"$f":"'App.2-BA_Fixed Asset Cont'!E626","v":0},null,0,null,0,0,0,0,0,{"$f":"-'App.2-BA_Fixed Asset Cont'!L626","v":0},0]
[1995,"Contributions & Grants",{"$f":"'App.2-BA_Fixed Asset Cont'!M537","v":-5479902.2400000002},null,-5479902.2400000002,0,null,0,{"$f":"'App.2-BA_Fixed Asset Cont'!E627","v":0},{"$f":"C463/'App.2-BA_Fixed Asset Cont'!D627*'App.2-C_DepExp'!L463","v":20.175079488396396},4.9566099631733564E-2,25,0.04,-271617.38039999997,0,0,-271617.38039999997,{"$f":"-'App.2-BA_Fixed Asset Cont'!L627","v":-1423706.18},-1152088.7996]
[2440,"Deferred Revenue",{"$f":"'App.2-BA_Fixed Asset Cont'!M538","v":-2535076.0817272728},null,null,{"$f":"I464","v":-652500},null,-652500,{"$f":"'App.2-BA_Fixed Asset Cont'!E628","v":-652500},{"$f":"C464/'App.2-BA_Fixed Asset Cont'!D628*'App.2-C_DepExp'!L464","v":56.937818821585275},1.7563019109205803E-2,60,1.6666666666666666E-2,0,-10875,-5437.5,-16312.5,{"$f":"-'App.2-BA_Fixed Asset Cont'!L628","v":-162012.03199999998},-145699.53199999998]
[null,"Total",{"$f":"SUM(C426:C464)","v":32851163.688272722},0,35386239.769999996,3549913.0435151476,0,3549913.0435151476,3549913.0435151476,null,null,null,null,{"$f":"SUM(N426:N464)","v":2262876.2491979795},128558.3612683051,64279.180634152552,2455713.7911004373,21734751.305149302,19279037.514048867]
[]
[]
["General:","Applicants are to complete this appendix to show the reasonability of the depreciation expense that is included in rate base via. Accumulated depreciation and the revenue requirement."]
[null,"Applicants must provide a breakdown of depreciation and amortization expense in the above format for all relevant accounts.  Balances presented in the table should exclude asset retirement obligations (AROs) and the related depreciation and accretion expense. These should be disclosed separately consistent with the Notes of historical Audited Financial Statements."]
[]
[]
["Notes:"]
[1,"This is the net book value of assets that existed as at the date of the utility's change in depreciation policies (i.e. as at Jan. 1, 2012 or Jan. 1, 2013).  These assets are to be depreciated at the average remaining service life. This amount will not change in years subsequent to the date of the utility's change in depreciation policies.  This column is expected to be used until the assets that existed as at the date of the utility's change in depreciation policies are fully depreciated."]
[2,"This is the opening gross book value of assets that have been acquired after the date of the utilities change in depreciation policies (i.e. additions starting in 2012/2013 for those who changed policies Jan. 1, 2012/2013). These assets are to be depreciated at the revised service life. The amount is expected to be equal to the gross book value of the prior year plus the prior year's additions."]
[3,"A recalculation should be performed to determine the average remaining life of opening balance of assets (i.e. excluding current year's additions) under the change in policies under CGAAP.  For example, Asset A had a useful life of 20 years under CGAAP without the change in policies.  On January 1 of the year of policy changes, Asset A was 3 years depreciated. As a result, Asset A would have a remaining service life of 17 years (20 years less 3 years) as at January 1 of the year of policy changes.  Due to making the change in policies under CGAAP, management re-assessed the asset useful lives and concluded that the revised useful life of Asset A is now 30 years. Therefore, the average remaining useful life of the opening balance of Asset A is determined to be 27 years (30 years less 3 years) under the revised CGAAP as at January 1 of the year of policy changes."]
[4,"The useful life used should be consistent with the OEB's regulatory accounting policies as set out in the  Accounting Procedures Handbook for Electricity Distributors, effective Jan. 1, 2012 and also with the Report of the Board, Transition to International Financial Reporting Standards, EB-2008-0408, and the Kinectrics Report."]
[5,"Board policy of the \"half-year\" rule - the applicant must ensure that additions in the year attract a half-year depreciation expense in the first year.  Deviations from this standard practice must be supported in the application."]
[6,"The applicant must provide an explanation of material variances in evidence."]
[7,"This should include assets in column a (excel column C) that become fully depreciated since the date of the policy change.  The amount input in b (excel column D) should equal the net book value of the asset as at the date of depreciation policy change"]
[8,"This should include assets in column d (excel column f) that have become fully depreciated.  The amount input in e (excel column G) should equal the gross book value of the asset"]
[]
[]
[]
["Scenario that applies",null,"Applicable Years and Accounting Standard",null,null,null,null,null,null,null,null,null,null,null,null,null,null,"Year Reflected in Schedule Below","Accounting Standard Reflected in Schedule Below"]
["Rebasing for the first time with depreciation policy changes made in 2012.",null,"This appendix must be duplicated and completed for the years 2012 to 2018. The appendix for 2012 is to be completed under CGAAP (prior to changes in depreciation policies). The appendix for 2012 to 2014 must be completed under Revised CGAAP (after changes in depreciation policies). The appendix for 2014 to 2018 is to be completed under MIFRS (2014 if changes to MIFRS are material)."]
["Rebasing for the first time with depreciation policy changes made in 2013.",null,"This appendix must be duplicated and completed for the years 2013 to 2018. The appendix for 2013 is to be completed under CGAAP (prior to changes in depreciation policies). The appendix for 2013 to 2014 must be completed under Revised CGAAP (after changes in depreciation policies). The appendix for 2014 to 2018 is to be completed under MIFRS (2014 if changes to MIFRS are material).",null,null,null,null,null,null,null,null,null,null,null,null,null,null,2018,"MIFRS"]
["Already rebased with depreciation policy changes in a prior rate application",null,"This appendix must be completed for 2014 to 2018. The appendix for 2014 is to be completed under Revised CGAAP (after changes in depreciation policies). The appendix for 2014 to 2018 is to be completed under MIFRS (2014 if changes to MIFRS are material)."]
[]
[]
[null,null,"Book Values",null,null,null,null,null,null,"Service Lives",null,null,null,"Depreciation Expense"]
["Account","Description","Opening Net  Book Value of Existing Assets as at Date of Policy Change (Jan. 1) 1","Less Fully Depreciated 7","Net Amount of Existing Assets Before Policy Change to be Depreciated ","Opening Gross Book Value of Assets Acquired After Policy Change 2","Less Fully Depreciated 8","Net Amount of Assets Acquired After Policy Change to be Depreciated ","Current Year Additions","Average Remaining Life of Assets Existing Before Policy Change 3","Depreciation Rate Assets Acquired After Policy Change","Life of Assets Acquired After Policy Change 4","Depreciation Rate on New Additions","Depreciation Expense on Assets Existing Before Policy Change","Depreciation Expense on Assets Acquired After Policy Change","Depreciation Expense on Current Year Additions 5","Total Current Year Depreciation Expense ","Depreciation Expense per Appendix 2-BA Fixed Assets, Column J \n ","Variance 6"]
[null,null,"a","b","c = a-b","d","e","f = d- e","g","h","i = 1/h","j","k = 1/j","l = c/h","m = f/j","n = g*0.5/j","o = l+m+n","p","q = p-o"]
[1611,"Computer Software (Formally known as Account 1925)",{"$f":"'App.2-BA_Fixed Asset Cont'!M590","v":255364.25666666636},null,{"$f":"C493-D493","v":255364.25666666636},{"$f":"'App.2-BA_Fixed Asset Cont'!E680","v":35000},null,{"$f":"F493-G493","v":35000},{"$f":"'App.2-BA_Fixed Asset Cont'!E680","v":35000},{"$f":"C493/'App.2-BA_Fixed Asset Cont'!D680*'App.2-C_DepExp'!L493","v":0.50800151379381298},{"$f":"IF(J493=0,0,1/J493)","v":1.9684980710625968},3,{"$f":"IF(L493=0,0,1/L493)","v":0.33333333333333331},{"$f":"IF(J493=0,0,+E493/J493)","v":502684.04666666663},{"$f":"IF(L493=0,0,+H493/L493)","v":11666.666666666666},{"$f":"IF(L493=0,0,+(I493*0.5)/L493)","v":5833.333333333333},{"$f":"IF(ISERROR(+N493+O493+P493), 0, +N493+O493+P493)","v":520184.04666666663},{"$f":"-'App.2-BA_Fixed Asset Cont'!L680","v":1403408.7400000002},{"$f":"IF(ISERROR(+R493-122), 0, +R493-Q493)","v":883224.69333333359}]
[1612,"Land Rights (Formally known as Account 1906)",{"$f":"'App.2-BA_Fixed Asset Cont'!M591","v":45679.040000000001},null,{"$f":"C494-D494","v":45679.040000000001},{"$f":"I494","v":0},null,{"$f":"F494-G494","v":0},{"$f":"'App.2-BA_Fixed Asset Cont'!E681","v":0},{"$f":"C494/'App.2-BA_Fixed Asset Cont'!D681*'App.2-C_DepExp'!L494","v":0},{"$f":"IF(J494=0,0,1/J494)","v":0},null,{"$f":"IF(L494=0,0,1/L494)","v":0},{"$f":"IF(J494=0,0,+E494/J494)","v":0},{"$f":"IF(L494=0,0,+H494/L494)","v":0},{"$f":"IF(L494=0,0,+(I494*0.5)/L494)","v":0},{"$f":"IF(ISERROR(+N494+O494+P494), 0, +N494+O494+P494)","v":0},{"$f":"-'App.2-BA_Fixed Asset Cont'!L681","v":0},{"$f":"IF(ISERROR(+R494-122), 0, +R494-Q494)","v":0}]
[1805,"Land",{"$f":"'App.2-BA_Fixed Asset Cont'!M592","v":178544.08000000002},null,178544.08000000002,0,null,0,{"$f":"'App.2-BA_Fixed Asset Cont'!E682","v":0},{"$f":"C495/'App.2-BA_Fixed Asset Cont'!D682*'App.2-C_DepExp'!L495","v":0},0,null,0,0,{"$f":"IF(L495=0,0,+H495/L495)","v":0},0,0,{"$f":"-'App.2-BA_Fixed Asset Cont'!L682","v":0},0]
[1808,"Buildings",{"$f":"'App.2-BA_Fixed Asset Cont'!M593","v":905638.44181818189},null,905638.44181818189,8000,null,8000,{"$f":"'App.2-BA_Fixed Asset Cont'!E683","v":8000},{"$f":"C496/'App.2-BA_Fixed Asset Cont'!D683*'App.2-C_DepExp'!L496","v":54.078401923956243},1.849167069334216E-2,60,1.6666666666666666E-2,16746.767833333335,133.33333333333334,66.666666666666671,16946.767833333335,{"$f":"-'App.2-BA_Fixed Asset Cont'!L683","v":110559.11303030302},93612.345196969691]
[1810,"Leasehold Improvements",{"$f":"'App.2-BA_Fixed Asset Cont'!M594","v":0},null,0,0,null,0,{"$f":"'App.2-BA_Fixed Asset Cont'!E684","v":0},null,0,null,0,0,0,0,0,{"$f":"-'App.2-BA_Fixed Asset Cont'!L684","v":0},0]
[1815,"Transformer Station Equipment >50 kV",{"$f":"'App.2-BA_Fixed Asset Cont'!M595","v":0},null,0,0,null,0,{"$f":"'App.2-BA_Fixed Asset Cont'!E685","v":0},null,0,null,0,0,0,0,0,{"$f":"-'App.2-BA_Fixed Asset Cont'!L685","v":0},0]
[1820,"Distribution Station Equipment <50 kV",{"$f":"'App.2-BA_Fixed Asset Cont'!M596","v":344916.28},null,344916.28,0,null,0,{"$f":"'App.2-BA_Fixed Asset Cont'!E686","v":0},{"$f":"C499/'App.2-BA_Fixed Asset Cont'!D686*'App.2-C_DepExp'!L499","v":36.550815024039053},2.7359171042897715E-2,60,1.6666666666666666E-2,9436.6235000000015,0,0,9436.6235000000015,{"$f":"-'App.2-BA_Fixed Asset Cont'!L686","v":231008.77999999997},221572.15649999998]
[1825,"Storage Battery Equipment",{"$f":"'App.2-BA_Fixed Asset Cont'!M597","v":0},null,0,0,null,0,{"$f":"'App.2-BA_Fixed Asset Cont'!E687","v":0},null,0,null,0,0,0,0,0,{"$f":"-'App.2-BA_Fixed Asset Cont'!L687","v":0},0]
[1830,"Poles, Towers & Fixtures",{"$f":"'App.2-BA_Fixed Asset Cont'!M598","v":6204717.9763980554},null,6204717.9763980554,477589.50375275349,null,477589.50375275349,{"$f":"'App.2-BA_Fixed Asset Cont'!E688","v":477589.50375275349},{"$f":"C501/'App.2-BA_Fixed Asset Cont'!D688*'App.2-C_DepExp'!L501","v":33.643153789816047},2.9723729417504997E-2,50,0.02,184427.35824238497,9551.7900750550689,4775.8950375275344,198755.04335496758,{"$f":"-'App.2-BA_Fixed Asset Cont'!L688","v":3198312.7364799115},2999557.6931249439]
[1835,"Overhead Conductors & Devices",{"$f":"'App.2-BA_Fixed Asset Cont'!M599","v":7854997.6898838449},null,7854997.6898838449,801602.34058092104,null,801602.34058092104,{"$f":"'App.2-BA_Fixed Asset Cont'!E689","v":801602.34058092104},{"$f":"C502/'App.2-BA_Fixed Asset Cont'!D689*'App.2-C_DepExp'!L502","v":30.450733552432069},3.2839931369079645E-2,60,1.6666666666666666E-2,257957.58504006464,13360.039009682017,6680.0195048410087,277997.64355458767,{"$f":"-'App.2-BA_Fixed Asset Cont'!L689","v":7880334.6345449053},7602336.9909903174]
[1840,"Underground Conduit",{"$f":"'App.2-BA_Fixed Asset Cont'!M600","v":2588157.022324434},null,2588157.022324434,166977.88230638162,null,166977.88230638162,{"$f":"'App.2-BA_Fixed Asset Cont'!E690","v":166977.88230638162},{"$f":"C503/'App.2-BA_Fixed Asset Cont'!D690*'App.2-C_DepExp'!L503","v":36.124646830613571},2.7681931526941799E-2,45,2.2222222222222223E-2,71645.185472958561,3710.6196068084805,1855.3098034042403,77211.114883171278,{"$f":"-'App.2-BA_Fixed Asset Cont'!L690","v":711216.24772080721},634005.13283763593]
[1845,"Underground Conductors & Devices",{"$f":"'App.2-BA_Fixed Asset Cont'!M601","v":6328432.1143036261},null,6328432.1143036261,399929.46999078494,null,399929.46999078494,{"$f":"'App.2-BA_Fixed Asset Cont'!E691","v":399929.46999078494},{"$f":"C504/'App.2-BA_Fixed Asset Cont'!D691*'App.2-C_DepExp'!L504","v":36.879468688124703},2.7115358099559686E-2,45,2.2222222222222223E-2,171597.70298809645,8887.3215553507762,4443.6607776753881,184928.68532112264,{"$f":"-'App.2-BA_Fixed Asset Cont'!L691","v":1583338.7386963144},1398410.0533751918]
[1850,"Line Transformers",{"$f":"'App.2-BA_Fixed Asset Cont'!M602","v":7859201.6895164866},null,7859201.6895164866,498350.80336915888,null,498350.80336915888,{"$f":"'App.2-BA_Fixed Asset Cont'!E692","v":498350.80336915888},{"$f":"C505/'App.2-BA_Fixed Asset Cont'!D692*'App.2-C_DepExp'!L505","v":32.671019474434686},3.0608166383742856E-2,40,2.5000000000000001E-2,240555.7529561136,12458.770084228972,6229.3850421144862,259243.90808245706,{"$f":"-'App.2-BA_Fixed Asset Cont'!L692","v":2003107.5224982284},1743863.6144157713]
[1855,"Services (Overhead & Underground)",{"$f":"'App.2-BA_Fixed Asset Cont'!M603","v":5178312.5900000008},null,5178312.5900000008,1087500,null,1087500,{"$f":"'App.2-BA_Fixed Asset Cont'!E693","v":1087500},{"$f":"C506/'App.2-BA_Fixed Asset Cont'!D693*'App.2-C_DepExp'!L506","v":44.258609747881756},2.2594473836762587E-2,60,1.6666666666666666E-2,117001.24833333334,18125,9062.5,144188.74833333335,{"$f":"-'App.2-BA_Fixed Asset Cont'!L693","v":1953833.7199999997},1809644.9716666664]
[1860,"Meters",{"$f":"'App.2-BA_Fixed Asset Cont'!M604","v":0},null,0,0,null,0,{"$f":"'App.2-BA_Fixed Asset Cont'!E694","v":0},null,0,25,0.04,0,0,0,0,{"$f":"-'App.2-BA_Fixed Asset Cont'!L694","v":0},0]
[1860,"Meters (Smart Meters)",{"$f":"'App.2-BA_Fixed Asset Cont'!M605","v":3151496.0999999996},null,3151496.0999999996,234500,null,234500,{"$f":"'App.2-BA_Fixed Asset Cont'!E695","v":234500},{"$f":"C508/'App.2-BA_Fixed Asset Cont'!D695*'App.2-C_DepExp'!L508","v":6.7197871192687408},0.14881423804818714,12,8.3333333333333329E-2,468987.49083333329,19541.666666666668,9770.8333333333339,498299.99083333329,{"$f":"-'App.2-BA_Fixed Asset Cont'!L695","v":2837517.5933333333},2339217.6025]
[1905,"Land",{"$f":"'App.2-BA_Fixed Asset Cont'!M606","v":0},null,0,0,null,0,{"$f":"'App.2-BA_Fixed Asset Cont'!E696","v":0},null,0,null,0,0,0,0,0,{"$f":"-'App.2-BA_Fixed Asset Cont'!L696","v":0},0]
[1908,"Buildings & Fixtures",{"$f":"'App.2-BA_Fixed Asset Cont'!M607","v":0},null,0,0,null,0,{"$f":"'App.2-BA_Fixed Asset Cont'!E697","v":0},null,0,null,0,0,0,0,0,{"$f":"-'App.2-BA_Fixed Asset Cont'!L697","v":0},0]
[1910,"Leasehold Improvements",{"$f":"'App.2-BA_Fixed Asset Cont'!M608","v":461072.59545454546},null,461072.59545454546,35000,null,35000,{"$f":"'App.2-BA_Fixed Asset Cont'!E698","v":35000},{"$f":"C511/'App.2-BA_Fixed Asset Cont'!D698*'App.2-C_DepExp'!L511","v":50.15167082695519},1.9939515144977514E-2,55,1.8181818181818181E-2,9193.5640000000003,636.36363636363637,318.18181818181819,10148.109454545454,{"$f":"-'App.2-BA_Fixed Asset Cont'!L698","v":53259.600909090906},43111.491454545452]
[1915,"Office Furniture & Equipment (10 years)",{"$f":"'App.2-BA_Fixed Asset Cont'!M609","v":14633.829999999987},null,14633.829999999987,0,null,0,{"$f":"'App.2-BA_Fixed Asset Cont'!E699","v":0},{"$f":"C512/'App.2-BA_Fixed Asset Cont'!D699*'App.2-C_DepExp'!L512","v":1.4976882993405436},0.66769567502150895,10,0.1,9770.9449999999997,0,0,9770.9449999999997,{"$f":"-'App.2-BA_Fixed Asset Cont'!L699","v":87186.12000000001},77415.175000000017]
[1915,"Office Furniture & Equipment (5 years)",{"$f":"'App.2-BA_Fixed Asset Cont'!M610","v":0},null,0,0,null,0,{"$f":"'App.2-BA_Fixed Asset Cont'!E700","v":0},null,0,null,0,0,0,0,0,{"$f":"-'App.2-BA_Fixed Asset Cont'!L700","v":0},0]
[1920,"Computer Equipment - Hardware",{"$f":"'App.2-BA_Fixed Asset Cont'!M611","v":0},null,0,0,null,0,{"$f":"'App.2-BA_Fixed Asset Cont'!E701","v":0},{"$f":"C514/'App.2-BA_Fixed Asset Cont'!D701*'App.2-C_DepExp'!L514","v":0},0,null,0,0,0,0,0,{"$f":"-'App.2-BA_Fixed Asset Cont'!L701","v":97941},97941]
[1920,"Computer Equip.-Hardware(Post Mar. 22/04)",{"$f":"'App.2-BA_Fixed Asset Cont'!M612","v":0},null,0,0,null,0,{"$f":"'App.2-BA_Fixed Asset Cont'!E702","v":0},{"$f":"C515/'App.2-BA_Fixed Asset Cont'!D702*'App.2-C_DepExp'!L515","v":0},0,null,0,0,0,0,0,{"$f":"-'App.2-BA_Fixed Asset Cont'!L702","v":3892},3892]
[1920,"Computer Equip.-Hardware(Post Mar. 19/07)",{"$f":"'App.2-BA_Fixed Asset Cont'!M613","v":75134.200000000012},null,75134.200000000012,21000,null,21000,{"$f":"'App.2-BA_Fixed Asset Cont'!E703","v":21000},{"$f":"C516/'App.2-BA_Fixed Asset Cont'!D703*'App.2-C_DepExp'!L516","v":1.7433960124151262},0.57359314400100081,5,0.2,43096.462,4200,2100,49396.462,{"$f":"-'App.2-BA_Fixed Asset Cont'!L703","v":178849.11},129452.64799999999]
[1930,"Transportation Equipment",{"$f":"'App.2-BA_Fixed Asset Cont'!M614","v":1145183.6300000008},null,1145183.6300000008,20000,null,20000,{"$f":"'App.2-BA_Fixed Asset Cont'!E704","v":20000},{"$f":"C517/'App.2-BA_Fixed Asset Cont'!D704*'App.2-C_DepExp'!L517","v":2.8735886680624203},0.34799691797026461,8,0.125,398520.37375000014,2500,1250,402270.37375000014,{"$f":"-'App.2-BA_Fixed Asset Cont'!L704","v":2245650.4200000004},1843380.0462500001]
[1935,"Stores Equipment",{"$f":"'App.2-BA_Fixed Asset Cont'!M615","v":0},null,0,0,null,0,{"$f":"'App.2-BA_Fixed Asset Cont'!E705","v":0},null,0,null,0,0,0,0,0,{"$f":"-'App.2-BA_Fixed Asset Cont'!L705","v":0},0]
[1940,"Tools, Shop & Garage Equipment",{"$f":"'App.2-BA_Fixed Asset Cont'!M616","v":87977.139999999985},null,87977.139999999985,20000,null,20000,{"$f":"'App.2-BA_Fixed Asset Cont'!E706","v":20000},{"$f":"C519/'App.2-BA_Fixed Asset Cont'!D706*'App.2-C_DepExp'!L519","v":3.1557558546411171},0.31688129439079288,10,0.1,27878.309999999994,2000,1000,30878.309999999994,{"$f":"-'App.2-BA_Fixed Asset Cont'!L706","v":210986.02},180107.71]
[1945,"Measurement & Testing Equipment",{"$f":"'App.2-BA_Fixed Asset Cont'!M617","v":13388.310000000001},null,13388.310000000001,0,null,0,{"$f":"'App.2-BA_Fixed Asset Cont'!E707","v":0},{"$f":"C520/'App.2-BA_Fixed Asset Cont'!D707*'App.2-C_DepExp'!L520","v":3.4459193903118579},0.29019831479850705,8,0.125,3885.2650000000003,0,0,3885.2650000000003,{"$f":"-'App.2-BA_Fixed Asset Cont'!L707","v":21579.08},17693.815000000002]
[1950,"Power Operated Equipment",{"$f":"'App.2-BA_Fixed Asset Cont'!M618","v":143068.60999999999},null,143068.60999999999,0,null,0,{"$f":"'App.2-BA_Fixed Asset Cont'!E708","v":0},{"$f":"C521/'App.2-BA_Fixed Asset Cont'!D708*'App.2-C_DepExp'!L521","v":5.0945966776280018},0.19628639189267302,8,0.125,28082.421249999996,0,0,28082.421249999996,{"$f":"-'App.2-BA_Fixed Asset Cont'!L708","v":109255.81999999999},81173.398749999993]
[1955,"Communications Equipment",{"$f":"'App.2-BA_Fixed Asset Cont'!M619","v":25532.32},null,25532.32,0,null,0,{"$f":"'App.2-BA_Fixed Asset Cont'!E709","v":0},{"$f":"C522/'App.2-BA_Fixed Asset Cont'!D709*'App.2-C_DepExp'!L522","v":0},0,null,0,0,0,0,0,{"$f":"-'App.2-BA_Fixed Asset Cont'!L709","v":9574.619999999999},9574.619999999999]
[1955,"Communication Equipment (Smart Meters)",{"$f":"'App.2-BA_Fixed Asset Cont'!M620","v":0},null,0,0,null,0,{"$f":"'App.2-BA_Fixed Asset Cont'!E710","v":0},null,0,null,0,0,0,0,0,{"$f":"-'App.2-BA_Fixed Asset Cont'!L710","v":0},0]
[1960,"Miscellaneous Equipment ",{"$f":"'App.2-BA_Fixed Asset Cont'!M621","v":0},null,0,0,null,0,{"$f":"'App.2-BA_Fixed Asset Cont'!E711","v":0},null,0,null,0,0,0,0,0,{"$f":"-'App.2-BA_Fixed Asset Cont'!L711","v":0},0]
[1970,"Load Management Controls Customer Premises",{"$f":"'App.2-BA_Fixed Asset Cont'!M622","v":0},null,0,0,null,0,{"$f":"'App.2-BA_Fixed Asset Cont'!E712","v":0},null,0,null,0,0,0,0,0,{"$f":"-'App.2-BA_Fixed Asset Cont'!L712","v":0},0]
[1975,"Load Management Controls Utility Premises",{"$f":"'App.2-BA_Fixed Asset Cont'!M623","v":0},null,0,0,null,0,{"$f":"'App.2-BA_Fixed Asset Cont'!E713","v":0},null,0,null,0,0,0,0,0,{"$f":"-'App.2-BA_Fixed Asset Cont'!L713","v":0},0]
[1980,"System Supervisor Equipment",{"$f":"'App.2-BA_Fixed Asset Cont'!M624","v":273842.40999999992},null,273842.40999999992,90000,null,90000,{"$f":"'App.2-BA_Fixed Asset Cont'!E714","v":90000},{"$f":"C527/'App.2-BA_Fixed Asset Cont'!D714*'App.2-C_DepExp'!L527","v":2.4350229656995563},0.41067374480088759,5,0.2,112459.88799999999,18000,9000,139459.88799999998,{"$f":"-'App.2-BA_Fixed Asset Cont'!L714","v":386113.87},246653.98200000002]
[1985,"Miscellaneous Fixed Assets",{"$f":"'App.2-BA_Fixed Asset Cont'!M625","v":0},null,0,0,null,0,{"$f":"'App.2-BA_Fixed Asset Cont'!E715","v":0},null,0,null,0,0,0,0,0,{"$f":"-'App.2-BA_Fixed Asset Cont'!L715","v":0},0]
[1990,"Other Tangible Property",{"$f":"'App.2-BA_Fixed Asset Cont'!M626","v":0},null,0,0,null,0,{"$f":"'App.2-BA_Fixed Asset Cont'!E716","v":0},null,0,null,0,0,0,0,0,{"$f":"-'App.2-BA_Fixed Asset Cont'!L716","v":0},0]
[1995,"Contributions & Grants",{"$f":"'App.2-BA_Fixed Asset Cont'!M627","v":-5366728.33},null,-5366728.33,0,null,0,{"$f":"'App.2-BA_Fixed Asset Cont'!E717","v":0},{"$f":"C530/'App.2-BA_Fixed Asset Cont'!D717*'App.2-C_DepExp'!L530","v":19.758412816207251},5.061135270843866E-2,25,0.04,-271617.38040000002,0,0,-271617.38040000002,{"$f":"-'App.2-BA_Fixed Asset Cont'!L717","v":-1536880.0899999999},-1265262.7095999997]
[2440,"Deferred Revenue",{"$f":"'App.2-BA_Fixed Asset Cont'!M628","v":-3161903.3479999998},null,null,{"$f":"I531","v":-652500},null,-652500,{"$f":"'App.2-BA_Fixed Asset Cont'!E718","v":-652500},{"$f":"C531/'App.2-BA_Fixed Asset Cont'!D718*'App.2-C_DepExp'!L531","v":57.075520640961678},1.7520646132876884E-2,60,1.6666666666666666E-2,0,-10875,-5437.5,-16312.5,{"$f":"-'App.2-BA_Fixed Asset Cont'!L718","v":-202514.31118181816},-186201.81118181816]
[null,"Total",{"$f":"SUM(C493:C531)","v":34606658.648365855},0,37768561.996365853,3242950,0,3242950,3242950,null,null,null,null,{"$f":"SUM(N493:N531)","v":2402309.6104662851},113896.57063415562,56948.285317077811,2573154.4664175184,23577531.086031079,21004376.619613562]
[]
[]
["General:","Applicants are to complete this appendix to show the reasonability of the depreciation expense that is included in rate base via. Accumulated depreciation and the revenue requirement."]
[null,"Applicants must provide a breakdown of depreciation and amortization expense in the above format for all relevant accounts.  Balances presented in the table should exclude asset retirement obligations (AROs) and the related depreciation and accretion expense. These should be disclosed separately consistent with the Notes of historical Audited Financial Statements."]
[]
[]
["Notes:"]
[1,"This is the net book value of assets that existed as at the date of the utility's change in depreciation policies (i.e. as at Jan. 1, 2012 or Jan. 1, 2013).  These assets are to be depreciated at the average remaining service life. This amount will not change in years subsequent to the date of the utility's change in depreciation policies.  This column is expected to be used until the assets that existed as at the date of the utility's change in depreciation policies are fully depreciated."]
[2,"This is the opening gross book value of assets that have been acquired after the date of the utilities change in depreciation policies (i.e. additions starting in 2012/2013 for those who changed policies Jan. 1, 2012/2013). These assets are to be depreciated at the revised service life. The amount is expected to be equal to the gross book value of the prior year plus the prior year's additions."]
[3,"A recalculation should be performed to determine the average remaining life of opening balance of assets (i.e. excluding current year's additions) under the change in policies under CGAAP.  For example, Asset A had a useful life of 20 years under CGAAP without the change in policies.  On January 1 of the year of policy changes, Asset A was 3 years depreciated. As a result, Asset A would have a remaining service life of 17 years (20 years less 3 years) as at January 1 of the year of policy changes.  Due to making the change in policies under CGAAP, management re-assessed the asset useful lives and concluded that the revised useful life of Asset A is now 30 years. Therefore, the average remaining useful life of the opening balance of Asset A is determined to be 27 years (30 years less 3 years) under the revised CGAAP as at January 1 of the year of policy changes."]
[4,"The useful life used should be consistent with the OEB's regulatory accounting policies as set out in the  Accounting Procedures Handbook for Electricity Distributors, effective Jan. 1, 2012 and also with the Report of the Board, Transition to International Financial Reporting Standards, EB-2008-0408, and the Kinectrics Report."]
[5,"Board policy of the \"half-year\" rule - the applicant must ensure that additions in the year attract a half-year depreciation expense in the first year.  Deviations from this standard practice must be supported in the application."]
[6,"The applicant must provide an explanation of material variances in evidence."]
[7,"This should include assets in column a (excel column C) that become fully depreciated since the date of the policy change.  The amount input in b (excel column D) should equal the net book value of the asset as at the date of depreciation policy change"]
[8,"This should include assets in column d (excel column f) that have become fully depreciated.  The amount input in e (excel column G) should equal the gross book value of the asset"]

{"sheet":"App.2-D_Overhead","index":12,"n_rows":49,"n_cols":8,"rows_kept":49,"cut":false,"hidden":false,"merged":[[63,0,64,0],[49,0,50,0],[49,1,50,1],[52,0,53,0],[55,0,56,0],[58,0,61,0],[8,0,8,7],[9,0,9,7],[13,0,15,0],[30,0,32,0],[30,7,32,7],[11,0,11,5],[28,0,28,5]]}
[null,null,null,null,null,"File Number:",{"$f":"EBNUMBER","v":"EB-2017-0038"}]
[null,null,null,null,null,"Exhibit:",4]
[null,null,null,null,null,"Tab:",2]
[null,null,null,null,null,"Schedule:"]
[null,null,null,null,null,"Page:"]
[]
[null,null,null,null,null,"Date:","Sept 12, 2017"]
[]
["Appendix 2-D"]
["Overhead Expense"]
[]
["Applicants are to provide a breakdown of OM&A before capitalization in the below table.  OM&A before capitalization may be broken down by cost center, program, drivers or another format best suited to focus on capitalized vs. uncapitalized OM&A."]
[]
[" OM&A Before Capitalization"]
[null,{"$f":"F15-4","v":2014},{"$f":"F15-3","v":2015},{"$f":"F15-2","v":2016},{"$f":"F15-1","v":2017},{"$f":"TestYear","v":2018}]
[null,"Historical Year","Historical Year","Historical Year","Bridge Year","Test Year"]
["Distribution",688177.10999999987,448729.16999999993,378375.58,384807.96486000001,413024.70026261994]
["Billing and Collecting",1259465.01,1111467.5499999998,981647.08,998335.08035999979,1040306.7767261198]
["Community Relations",22871,21168,24584,24953,25327]
["Administrative and General",{"$f":"3655306.52+721269","v":4376575.5199999996},{"$f":"4232026.07+702173","v":4934199.07},{"$f":"4632478.1+641918","v":5274396.0999999996},{"$f":"4798766.0027+657802","v":5456568.0027000001},{"$f":"5003436.82192176+687703","v":5691139.8219217602}]
[]
[]
[]
[]
[]
[]
["Total OM&A Before Capitalization (B)",{"$f":"SUM(B17:B26)","v":6347088.6399999997},{"$f":"SUM(C17:C26)","v":6515563.79},{"$f":"SUM(D17:D26)","v":6659002.7599999998},{"$f":"SUM(E17:E26)","v":6864664.0479199998},{"$f":"SUM(F17:F26)","v":7169798.2989105005}]
[]
["Applicants are to provide a breakdown of capitalized OM&A in the below table.  Capitalized OM&A may be broken down using the categories listed in the table below if possible.  Otherwise, applicants are to provide its own break down of capitalized OM&A."]
[]
["Capitalized OM&A",null,null,null,null,null,"Directly","Explanation for Change in Overhead Capitalized"]
[null,{"$f":"F32-4","v":2014},{"$f":"F32-3","v":2015},{"$f":"F32-2","v":2016},{"$f":"F32-1","v":2017},{"$f":"TestYear","v":2018},"Attributable?"]
[null,"Historical Year","Historical Year","Historical Year","Bridge Year","Test Year","(Yes/No)"]
[]
["Labour Burden",744139.28000000806,723340.68000000028,666501.99000001198,682754.82527120004,713030.48288015509,"Yes","Training expenses no longer Capitalized under MIFRS"]
["Material Burden",0,0,0,0,0,"Yes","No Changes necessary on transition to MIFRS"]
["Vehicle Burden",0,0,0,0,0,"Yes","No Changes necessary on transition to MIFRS"]
[]
[]
[]
[]
[]
[]
[]
["Insert description of additional item(s) and new rows if needed"]
[]
["Total Capitalized OM&A (A)",{"$f":"SUM(B34:B46)","v":744139.28000000806},{"$f":"SUM(C34:C46)","v":723340.68000000028},{"$f":"SUM(D34:D46)","v":666501.99000001198},{"$f":"SUM(E34:E46)","v":682754.82527120004},{"$f":"SUM(F34:F46)","v":713030.48288015509}]
[]
["% of Capitalized OM&A (=A/B)",{"$f":"IF(ISERROR(B47/B27),\"0%\",B47/B27)","v":0.11724104108305128},{"$f":"IF(ISERROR(C47/C27),\"0%\",C47/C27)","v":0.11101735833055212},{"$f":"IF(ISERROR(D47/D27),\"0%\",D47/D27)","v":0.10009036097771673},{"$f":"IF(ISERROR(E47/E27),\"0%\",E47/E27)","v":9.9459321025050812E-2},{"$f":"IF(ISERROR(F47/F27),\"0%\",F47/F27)","v":9.9449169021742903E-2}]

{"sheet":"App.2-EA_Account 1575 (2015)","index":13,"n_rows":47,"n_cols":9,"rows_kept":47,"cut":false,"hidden":false,"merged":[[47,0,47,9],[52,0,53,8],[25,1,26,5],[31,1,31,5],[37,6,38,7],[37,8,38,8],[20,1,20,5],[8,0,8,8],[9,0,9,8],[10,0,10,8],[12,0,12,8],[14,0,14,8]]}
[null,null,null,null,null,null,null,"File Number:",{"$f":"EBNUMBER","v":"EB-2017-0038"}]
[null,null,null,null,null,null,null,"Exhibit:"]
[null,null,null,null,null,null,null,"Tab:"]
[null,null,null,null,null,null,null,"Schedule:"]
[null,null,null,null,null,null,null,"Page:"]
[]
[null,null,null,null,null,null,null,"Date:"]
[]
["Appendix 2-EA"]
["Account 1575 - IFRS-CGAAP Transitional PP&E Amounts"]
["2015 Adopters of IFRS for Financial Reporting Purposes"]
[]
["For applicants that adopted IFRS on January 1, 2015 for financial reporting purposes"]
["Not required"]
[]
[]
[null,2014,{"$f":"TestYear-3","v":2015},{"$f":"TestYear-2","v":2016},{"$f":"CONCATENATE(TestYear-1,\" Bridge Year\")","v":"2017 Bridge Year"},{"$f":"CONCATENATE(TestYear,\" Rebasing Year\")","v":"2018 Rebasing Year"}]
["Reporting Basis","CGAAP","CGAAP","CGAAP","MIFRS","MIFRS"]
[null,"Actual","Actual","Actual","Forecast","Forecast"]
[null,null,null,"$","$"]
["PP&E Values under CGAAP"]
["            Opening net PP&E - Note 1"]
["            Net Additions - Note 4"]
["            Net Depreciation (amounts should be negative) - Note 4"]
["            Closing net PP&E (1)"]
[]
["PP&E Values under MIFRS (Starts from 2014, the transition year)"]
["            Opening net PP&E  - Note 1"]
["            Net Additions - Note 4"]
["            Net Depreciation (amounts should be negative) - Note 4"]
["            Closing net PP&E (2)"]
[]
["Difference in Closing net PP&E, former CGAAP vs. revised CGAAP ",{"$f":"B25-B31","v":0},{"$f":"C25-C31","v":0},{"$f":"D25-D31","v":0},{"$f":"E25-E31","v":0}]
[]
[]
["Effect on Deferral and Variance Account Rate Riders"]
["Closing balance in Account 1575",null,null,null,null,{"$f":"IF(ISERROR(E33), 0, E33)","v":0},null,"WACC"]
["Return on Rate Base Associated with Account 1575 balance at WACC  - Note 2",null,null,null,null,{"$f":"E33*I37*I38","v":0},"# of years of rate rider disposition period"]
["     Amount included in Deferral and Variance Account Rate Rider Calculation",null,null,null,null,{"$f":"F37+F38","v":0}]
[]
["Notes:"]
["1  For an applicant that adopted IFRS on January 1, 2015, the PP&E values as of January 1, 2014 under both CGAAP and MIFRS should be the same. "]
["2 Return on rate base associated with deferred balance is calculated as:"]
["     the deferral account closing balance as of 2017 x WACC X # of years of rate rider disposition period"]
["     * Please note that the calculation should be adjusted once WACC is updated and finalized in the rate application."]
["3  The  PP&E deferral account is cleared by including the total balance in the deferral and variance account rate rider calculation."]
["4  Net additions are additions net of disposals; Net depreciation is additions to depreciation net of disposals."]

{"sheet":"App.2-EB_Account 1576 (2012)","index":14,"n_rows":48,"n_cols":12,"rows_kept":48,"cut":false,"hidden":false,"merged":[[41,0,41,12],[45,0,45,10],[8,0,8,11],[9,0,9,11],[10,0,10,11],[12,0,13,11],[14,0,14,11],[20,1,20,8],[25,1,26,8],[31,1,31,8],[37,9,38,10],[37,11,38,11]]}
[null,null,null,null,null,null,null,null,null,null,"File Number:",{"$f":"EBNUMBER","v":"EB-2017-0038"}]
[null,null,null,null,null,null,null,null,null,null,"Exhibit:"]
[null,null,null,null,null,null,null,null,null,null,"Tab:"]
[null,null,null,null,null,null,null,null,null,null,"Schedule:"]
[null,null,null,null,null,null,null,null,null,null,"Page:"]
[]
[null,null,null,null,null,null,null,null,null,null,"Date:"]
[]
["Appendix 2-EB"]
["Account 1576 - Accounting Changes under CGAAP"]
["2012 Changes in Accounting Policies under CGAAP"]
[]
["For applicants with a balance in Account 1576 and made capitalization and depreciation expense accounting policy changes under CGAAP effective January 1, 2012.  This is the first time the applicant is rebasing with changes in these accounting policies."]
[]
[]
[]
[null,"Prior Years Rebasing",2012,2013,2014,2015,2016,2017,"2018 Rebasing Year"]
["Reporting Basis","CGAAP","CGAAP","CGAAP","CGAAP","MIFRS - Note 5","MIFRS","MIFRS","MIFRS"]
[null,"Forecast","Actual","Actual","Actual","Actual","Actual","Forecast","Forecast"]
[null,null,"$","$","$","$","$","$"]
["PP&E Values under former CGAAP"]
["            Opening net PP&E - Note 1",null,null,{"$f":"+C25","v":0},{"$f":"+D25","v":0},{"$f":"+E25","v":0},{"$f":"+F25","v":0},{"$f":"+G25","v":0}]
["            Net Additions - Note 4"]
["            Net Depreciation (amounts should be negative) - Note 4"]
["            Closing net PP&E (1)",null,{"$f":"C22+C23+C24","v":0},0,0,0,0,0]
[]
["PP&E Values under revised CGAAP (Starts from 2012)"]
["            Opening net PP&E  - Note 1",null,null,{"$f":"+C31","v":0},{"$f":"+D31","v":0},{"$f":"+E31","v":0},{"$f":"+F31","v":0},{"$f":"+G31","v":0}]
["            Net Additions - Note 4"]
["            Net Depreciation (amounts should be negative) - Note 4"]
["            Closing net PP&E (2)",null,{"$f":"SUM(C28:C30)","v":0},0,0,0,0,0]
[]
["Difference in Closing net PP&E, former CGAAP vs. revised CGAAP ",null,{"$f":"C25-C31","v":0},0,0,0,0,0]
[]
[]
["Effect on Deferral and Variance Account Rate Riders"]
["Closing balance in Account 1576",null,null,null,null,null,null,null,{"$f":"IF(ISERROR(H33), 0, H33)","v":0},null,"WACC"]
["Return on Rate Base Associated with Account 1576 balance at WACC  - Note 2",null,null,null,null,null,null,null,{"$f":"H33*L37*L38","v":0},"# of years of rate rider disposition period"]
["     Amount included in Deferral and Variance Account Rate Rider Calculation",null,null,null,null,null,null,null,{"$f":"I37+I38","v":0}]
[]
["Notes:"]
["1  For an applicant that made the capitalization and depreciation expense accounting policy changes on January 1, 2012, the PP&E values as of January 1, 2012 under both former CGAAP and revised CGAAP should be the same. "]
["2 Return on rate base associated with Account 1576 balance is calculated as:"]
["     the variance account ending balance as of 2017 x WACC X # of years of rate rider disposition period"]
["     * Please note that the calculation should be adjusted once WACC is updated and finalized in the rate application."]
["3  Account 1576 is cleared by including the total balance in the deferral and variance account rate rider calculation."]
["4  Net additions are additions net of disposals; Net depreciation is additions to depreciation net of disposals."]
["5 Differences due to the adoption of MIFRS are to be shown separately in Account 1575 in Appendix 2-EA as Accounts 1575 and 1576 cannot be used interchangably."]

{"sheet":"App.2-EC_Account 1576 (2013)","index":15,"n_rows":48,"n_cols":11,"rows_kept":48,"cut":false,"hidden":false,"merged":[[45,0,45,9],[8,0,8,10],[9,0,9,10],[10,0,10,10],[12,0,12,10],[14,0,14,10],[37,10,38,10],[20,1,20,7],[25,1,26,7],[31,1,31,7],[37,8,38,9],[41,0,41,11]]}
[null,null,null,null,null,null,null,null,null,"File Number:",{"$f":"EBNUMBER","v":"EB-2017-0038"}]
[null,null,null,null,null,null,null,null,null,"Exhibit:",9]
[null,null,null,null,null,null,null,null,null,"Tab:",6]
[null,null,null,null,null,null,null,null,null,"Schedule:"]
[null,null,null,null,null,null,null,null,null,"Page:",15]
[]
[null,null,null,null,null,null,null,null,null,"Date:","Sept 12, 2017"]
[]
["Appendix 2-EC"]
["Account 1576 - Accounting Changes under CGAAP"]
["2013 Changes in Accounting Policies under CGAAP"]
["completd"]
["For applicants with a balance in Account 1576 and made capitalization and depreciation expense accounting policy changes under CGAAP effective January 1, 2013.  This is the first time the applicant is rebasing with changes in these accounting policies."]
[]
[]
[]
[null,"Prior Years Rebasing",2013,2014,2015,2016,2017,"2018 Rebasing Year"]
["Reporting Basis","CGAAP","CGAAP","CGAAP","MIFRS - Note 5","MIFRS","MIFRS","MIFRS"]
[null,"Actual","Actual","Actual","Actual","Actual","Forecast","Forecast"]
[null,null,"$","$",null,"$"]
["PP&E Values under former CGAAP"]
["            Opening net PP&E - Note 1",null,26545715,{"$f":"+C25","v":28143435},{"$f":"+D25","v":29401295},{"$f":"+E25","v":31930391},{"$f":"+F25","v":33717826}]
["            Net Additions - Note 4",null,3437911,3238030,4433110,2869561]
["            Net Depreciation (amounts should be negative) - Note 4",null,-1840191,-1980170,-1904014,-1082126]
["            Closing net PP&E (1)",null,{"$f":"C22+C23+C24","v":28143435},{"$f":"D22+D23+D24","v":29401295},{"$f":"E22+E23+E24","v":31930391},{"$f":"F22+F23+F24","v":33717826},{"$f":"G22+G23+G24","v":33717826}]
[]
["PP&E Values under revised CGAAP (Starts from 2012)"]
["            Opening net PP&E  - Note 1",null,26545715,{"$f":"+C31","v":28304279},{"$f":"+D31","v":29960246},{"$f":"+E31","v":32939132},{"$f":"+F31","v":34693477}]
["            Net Additions - Note 4",null,3179596,2973121,4158015,2122686]
["            Net Depreciation (amounts should be negative) - Note 4",null,-1421032,-1317154,-1179129,-368341]
["            Closing net PP&E (2)",null,{"$f":"SUM(C28:C30)","v":28304279},{"$f":"SUM(D28:D30)","v":29960246},{"$f":"SUM(E28:E30)","v":32939132},{"$f":"SUM(F28:F30)","v":34693477},{"$f":"SUM(G28:G30)","v":34693477}]
[]
["Difference in Closing net PP&E, former CGAAP vs. revised CGAAP ",null,{"$f":"C25-C31","v":-160844},{"$f":"D25-D31","v":-558951},{"$f":"E25-E31","v":-1008741},{"$f":"F25-F31","v":-975651},{"$f":"G25-G31","v":-975651}]
[]
[]
["Effect on Deferral and Variance Account Rate Riders"]
["Closing balance in Account 1576",null,null,null,null,null,null,{"$f":"IF(ISERROR(G33), 0, G33)","v":-975651},null,"WACC",7.4999999999999997E-2]
["Return on Rate Base Associated with Account 1576 balance at WACC  - Note 2",null,null,null,null,null,null,{"$f":"G33*K37*K38","v":-73173.824999999997},"# of years of rate rider disposition period",null,1]
["     Amount included in Deferral and Variance Account Rate Rider Calculation",null,null,null,null,null,null,{"$f":"H37+H38","v":-1048824.825}]
[]
["Notes:"]
["1  For an applicant that made the capitalization and depreciation expense accounting policy changes on January 1, 2013, the PP&E values as of January 1, 2013 under both former CGAAP and revised CGAAP should be the same. "]
["2 Return on rate base associated with Account 1576 balance is calculated as:"]
["     the variance account ending balance as of 2017 x WACC X # of years of rate rider disposition period"]
["     * Please note that the calculation should be adjusted once WACC is updated and finalized in the rate application."]
["3  Account 1576 is cleared by including the total balance in the deferral and variance account rate rider calculation."]
["4  Net additions are additions net of disposals; Net depreciation is additions to depreciation net of disposals."]
["5 Differences due to the adoption of MIFRS are to be shown separately in Account 1575 in Appendix 2-EA as Accounts 1575 and 1576 cannot be used interchangably."]

{"sheet":"App.2-FA Proposed REG Invest.","index":16,"n_rows":101,"n_cols":11,"rows_kept":101,"cut":false,"hidden":false,"merged":[[8,0,8,10],[17,0,17,8],[16,0,16,9],[12,0,12,6],[13,0,13,5],[14,0,14,5],[11,0,11,6],[9,0,9,10]]}
[null,null,null,null,null,null,null,null,null,"File Number:",{"$f":"EBNUMBER","v":"EB-2017-0038"}]
[null,null,null,null,null,null,null,null,null,"Exhibit:"]
[null,null,null,null,null,null,null,null,null,"Tab:"]
[null,null,null,null,null,null,null,null,null,"Schedule:"]
[null,null,null,null,null,null,null,null,null,"Page:"]
[]
[null,null,null,null,null,null,null,null,null,"Date:"]
[]
["Appendix 2-FA"]
["Renewable Generation Connection Investment Summary (past investments or over the future rate setting period)"]
[]
["Enter the details of the Renewable Generation Connection projects as described in the appropriate section of the Filing Requirements."]
["All costs entered on this page will be transferred to the appropriate cells in the appendices that follow."]
["For Part A, Renewable Enabling Improvements (REI), these amounts will be transferred to Appendix 2 - FB"]
["For Part B, Expansions, these amounts will be transferred to Appendix 2 - FC"]
[]
["If there are more than five projects proposed to be in-service in a certain year, please amend the tables below and ensure that the formulae for the Total Amounts in any given rate year are updated."]
["Based on the current methodology and allocation, amounts allocated represent 6% for REI Connection Investments and 17% for Expansion Investments. (EB-2009-0349, 6-10-2010, p. 15, note 9)"]
[]
["There are two scenarios described below.  Separate sets of spreadsheets (2-FA, 2-FB, 2-FC) should be submited for each scenario as required."]
["Scenario 1:  Past Investments with No Recovery.  The distributor has made investments in the past (during the IRM Years), but has not received approval for these projects and therefore did not receive"]
["revenue from the IESO under Regulation 330/09 and did not receive ratepayer revenue for the direct benefit portion of the investment."]
["The WCA percentage, debt percentages, interest rates, kWh, tax rates, amortization period, CCA Class and percentage should correspond to the distributor's last Cost of Service approval. "]
["The Direct Benefit portion of the calculated Revenue Requirement for each year should be summed and can be applied for recovery from the distributor's ratepayers through a rate rider."]
["The Provincial Recovery portion of the calculated Revenue Requirement for each year should be summed and can be applied for recovery from the IESO through a separate order."]
[]
["Scenario 2:  Investments in the Test Year and Beyond.  Distributor plans to make investments in 2017 and/or beyond.  These investments should be added to 2-FA in the appropriate year."]
["The WCA percentage, debt percentages, interest rates, kWh, tax rates, amortization period, CCA Class and percentage should correspond to the distributor's current application. "]
[]
["Part A",null,null,null,null,null,"Test Year"]
["REI Investments (Direct Benefit at 6%)",null,{"$f":"D31-1","v":2014},{"$f":"E31-1","v":2015},{"$f":"F31-1","v":2016},{"$f":"G31-1","v":2017},{"$f":"TestYear","v":2018},{"$f":"G31+1","v":2019},{"$f":"H31+1","v":2020},{"$f":"I31+1","v":2021},{"$f":"J31+1","v":2022}]
["Project 1"]
["Name: REI Connection Project"]
["Capital Costs",null,0,0,0,0,0,0,0,0,0]
["OM&A (Start-Up)",null,0,0,0,0,0,0,0,0,0]
["OM&A (Ongoing)",null,0,0,0,0,0,0,0,0,0]
[]
["Project 2"]
["Name: REI Connection Project"]
["Capital Costs",null,0,0,0,0,0,0,0,0,0]
["OM&A (Start-Up)",null,0,0,0,0,0,0,0,0,0]
["OM&A (Ongoing)",null,0,0,0,0,0,0,0,0,0]
[]
["Project 3"]
["Name: REI Connection Project"]
["Capital Costs",null,0,0,0,0,0,0,0,0,0]
["OM&A (Start-Up)",null,0,0,0,0,0,0,0,0,0]
["OM&A (Ongoing)",null,0,0,0,0,0,0,0,0,0]
[]
["Project 4"]
["Name: REI Connection Project"]
["Capital Costs",null,0,0,0,0,0,0,0,0,0]
["OM&A (Start-Up)",null,0,0,0,0,0,0,0,0,0]
["OM&A (Ongoing)",null,0,0,0,0,0,0,0,0,0]
[]
["Project 5"]
["Name: REI Connection Project"]
["Capital Costs",null,0,0,0,0,0,0,0,0,0]
["OM&A (Start-Up)",null,0,0,0,0,0,0,0,0,0]
["OM&A (Ongoing)",null,0,0,0,0,0,0,0,0,0]
[]
["Total Capital Costs",null,{"$f":"SUM(C58,C52,C46,C40,C34)","v":0},0,0,0,{"$f":"SUM(G58,G52,G46,G40,G34)","v":0},{"$f":"SUM(H58,H52,H46,H40,H34)","v":0},0,0,0]
["Total OM&A (Start-Up)",null,0,0,0,0,{"$f":"SUM(G59,G53,G47,G41,G35)","v":0},0,0,0,0]
["Total OM&A (Ongoing)",null,0,0,0,0,{"$f":"SUM(G60,G54,G48,G42,G36)","v":0},0,0,0,0]
[]
[]
["Part B",null,null,null,null,null,"Test Year"]
["Expansion Investments (Direct Benefit at 17%)",null,{"$f":"D68-1","v":2014},{"$f":"E68-1","v":2015},{"$f":"F68-1","v":2016},{"$f":"G68-1","v":2017},{"$f":"TestYear","v":2018},{"$f":"G68+1","v":2019},{"$f":"H68+1","v":2020},{"$f":"I68+1","v":2021},{"$f":"J68+1","v":2022}]
["Project 1"]
["Name: Expansion Connection Project"]
["Capital Costs",null,0,0,0,0,0,0,0,0,0]
["OM&A (Start-Up)",null,0,0,0,0,0,0,0,0,0]
["OM&A (Ongoing)",null,0,0,0,0,0,0,0,0,0]
[]
["Project 2"]
["Name: Expansion Connection Project"]
["Capital Costs",null,0,0,0,0,0,0,0,0,0]
["OM&A (Start-Up)",null,0,0,0,0,0,0,0,0,0]
["OM&A (Ongoing)",null,0,0,0,0,0,0,0,0,0]
[]
["Project 3"]
["Name: Expansion Connection Project"]
["Capital Costs",null,0,0,0,0,0,0,0,0,0]
["OM&A (Start-Up)",null,0,0,0,0,0,0,0,0,0]
["OM&A (Ongoing)",null,0,0,0,0,0,0,0,0,0]
[]
["Project 4"]
["Name: Expansion Connection Project"]
["Capital Costs",null,0,0,0,0,0,0,0,0,0]
["OM&A (Start-Up)",null,0,0,0,0,0,0,0,0,0]
["OM&A (Ongoing)",null,0,0,0,0,0,0,0,0,0]
[]
["Project 5"]
["Name: Expansion Connection Project"]
["Capital Costs",null,0,0,0,0,0,0,0,0,0]
["OM&A (Start-Up)",null,0,0,0,0,0,0,0,0,0]
["OM&A (Ongoing)",null,0,0,0,0,0,0,0,0,0]
[]
["Total Capital Costs",null,{"$f":"SUM(C95,C89,C83,C77,C71)","v":0},0,0,0,{"$f":"SUM(G95,G89,G83,G77,G71)","v":0},{"$f":"SUM(H95,H89,H83,H77,H71)","v":0},0,0,0]
["Total OM&A (Start-Up)",null,0,0,0,0,{"$f":"SUM(G96,G90,G84,G78,G72)","v":0},0,0,0,0]
["Total OM&A (Ongoing)",null,0,0,0,0,{"$f":"SUM(G97,G91,G85,G79,G73)","v":0},0,0,0,0]

{"sheet":"App.2-FB Calc of REG Improvemnt","index":17,"n_rows":95,"n_cols":29,"rows_kept":95,"cut":false,"hidden":false,"merged":[[16,26,16,28],[8,0,8,17],[9,0,9,17],[11,0,11,17],[12,0,12,17],[14,0,14,17],[46,0,46,22],[16,14,16,16],[16,17,16,19],[16,20,16,22],[16,23,16,25],[16,11,16,13],[16,8,16,10],[16,5,16,7],[16,2,16,4],[51,24,51,25],[51,27,51,28],[48,0,48,22],[49,0,49,1],[51,15,51,16],[51,18,51,19],[51,21,51,22],[51,12,51,13],[51,9,51,10],[51,6,51,7],[51,3,51,4]]}
[null,null,null,null,null,null,null,null,null,null,null,null,null,"File Number:",{"$f":"EBNUMBER","v":"EB-2017-0038"}]
[null,null,null,null,null,null,null,null,null,null,null,null,null,"Exhibit:"]
[null,null,null,null,null,null,null,null,null,null,null,null,null,"Tab:"]
[null,null,null,null,null,null,null,null,null,null,null,null,null,"Schedule:"]
[null,null,null,null,null,null,null,null,null,null,null,null,null,"Page:"]
[]
[null,null,null,null,null,null,null,null,null,null,null,null,null,"Date:"]
[]
["Appendix 2-FB"]
["Calculation of Renewable Generation Connection Direct Benefits/Provincial Amount: Renewable Enabling Improvement Investments"]
[]
["This table will calculate the distributor/provincial shares of the investments entered in Part A of Appendix 2-FA."]
["Enter values in green shaded cells: WCA percentage, debt percentages, interest rates, kWh, tax rates, amortization period, CCA Class and percentage."]
["For historical investments, enter these variables for your last cost of service test year.  For 2017 and beyond, enter variables as in the application."]
["Rate Riders are not calculated for the Test Year as these assets and costs are already in the distributor's rate base/revenue requirement."]
[]
[null,null,{"$f":"F17-1","v":2014},null,null,{"$f":"I17-1","v":2015},null,null,{"$f":"L17-1","v":2016},null,null,{"$f":"BridgeYear","v":2017},null,null,{"$f":"CONCATENATE(TestYear,\" Test Year\")","v":"2018 Test Year"},null,null,{"$f":"TestYear+1","v":2019},null,null,{"$f":"R17+1","v":2020},2016,null,{"$f":"U17+1","v":2021},null,null,{"$f":"X17+1","v":2022}]
[null,null,null,"Direct Benefit","Provincial",null,"Direct Benefit","Provincial",null,"Direct Benefit","Provincial",null,"Direct Benefit","Provincial",null,"Direct Benefit","Provincial",null,"Direct Benefit","Provincial",null,"Direct Benefit","Provincial",null,"Direct Benefit","Provincial",null,"Direct Benefit","Provincial"]
[null,null,"Total",0.06,0.94,"Total",0.06,0.94,"Total",0.06,0.94,"Total",0.06,0.94,"Total",0.06,0.94,"Total",0.06,0.94,"Total",0.06,0.94,"Total",0.06,0.94,"Total",0.06,0.94]
["Net Fixed Assets (average)",null,{"$f":"D82","v":0},{"$f":"C20*D19","v":0},{"$f":"C20*E19","v":0},{"$f":"E82","v":0},{"$f":"F20*G19","v":0},{"$f":"F20*H19","v":0},{"$f":"F82","v":0},{"$f":"I20*J19","v":0},{"$f":"I20*K19","v":0},{"$f":"G82","v":0},{"$f":"L20*M19","v":0},{"$f":"L20*N19","v":0},{"$f":"H82","v":0},{"$f":"O20*P19","v":0},{"$f":"O20*Q19","v":0},{"$f":"I82","v":0},{"$f":"R20*S19","v":0},{"$f":"R20*T19","v":0},{"$f":"J82","v":0},{"$f":"U20*V19","v":0},{"$f":"U20*W19","v":0},{"$f":"K82","v":0},{"$f":"X20*Y19","v":0},{"$f":"X20*Z19","v":0},{"$f":"L82","v":0},{"$f":"AA20*AB19","v":0},{"$f":"AA20*AC19","v":0}]
["Incremental OM&A (on-going, N/A for Provincial Recovery)",null,{"$f":"'App.2-FA Proposed REG Invest.'!C64","v":0},{"$f":"C21","v":0},null,{"$f":"'App.2-FA Proposed REG Invest.'!D64","v":0},{"$f":"F21","v":0},null,{"$f":"'App.2-FA Proposed REG Invest.'!E64","v":0},{"$f":"I21","v":0},null,{"$f":"'App.2-FA Proposed REG Invest.'!F64","v":0},{"$f":"L21","v":0},null,{"$f":"'App.2-FA Proposed REG Invest.'!G64","v":0},{"$f":"O21","v":0},null,{"$f":"'App.2-FA Proposed REG Invest.'!H64","v":0},{"$f":"R21","v":0},null,{"$f":"'App.2-FA Proposed REG Invest.'!I64","v":0},{"$f":"U21","v":0},null,{"$f":"'App.2-FA Proposed REG Invest.'!J64","v":0},{"$f":"X21","v":0},null,{"$f":"'App.2-FA Proposed REG Invest.'!K64","v":0},{"$f":"AA21","v":0}]
["Incremental OM&A (start-up, applicable for Provincial Recovery)",null,{"$f":"'App.2-FA Proposed REG Invest.'!C63","v":0},{"$f":"C22*D19","v":0},{"$f":"C22*E19","v":0},{"$f":"'App.2-FA Proposed REG Invest.'!D63","v":0},{"$f":"F22*G19","v":0},{"$f":"F22*H19","v":0},{"$f":"'App.2-FA Proposed REG Invest.'!E63","v":0},{"$f":"I22*J19","v":0},{"$f":"I22*K19","v":0},{"$f":"'App.2-FA Proposed REG Invest.'!F63","v":0},{"$f":"L22*M19","v":0},{"$f":"L22*N19","v":0},{"$f":"'App.2-FA Proposed REG Invest.'!G63","v":0},{"$f":"O22*P19","v":0},{"$f":"O22*Q19","v":0},{"$f":"'App.2-FA Proposed REG Invest.'!H63","v":0},{"$f":"R22*S19","v":0},{"$f":"R22*T19","v":0},{"$f":"'App.2-FA Proposed REG Invest.'!I63","v":0},{"$f":"U22*V19","v":0},{"$f":"U22*W19","v":0},{"$f":"'App.2-FA Proposed REG Invest.'!J63","v":0},{"$f":"X22*Y19","v":0},{"$f":"X22*Z19","v":0},{"$f":"'App.2-FA Proposed REG Invest.'!K63","v":0},{"$f":"AA22*AB19","v":0},{"$f":"AA22*AC19","v":0}]
["WCA",null,null,{"$f":"(D21+D22)*$B$23","v":0},{"$f":"E22*$B$23","v":0},null,{"$f":"(G21+G22)*$B$23","v":0},{"$f":"H22*$B$23","v":0},null,{"$f":"(J21+J22)*$B$23","v":0},{"$f":"K22*$B$23","v":0},null,{"$f":"(M21+M22)*$B$23","v":0},{"$f":"N22*$B$23","v":0},null,{"$f":"(P21+P22)*$B$23","v":0},{"$f":"Q22*$B$23","v":0},null,{"$f":"(S21+S22)*$B$23","v":0},{"$f":"T22*$B$23","v":0},null,{"$f":"(V21+V22)*$B$23","v":0},{"$f":"W22*$B$23","v":0},null,{"$f":"(Y21+Y22)*$B$23","v":0},{"$f":"Z22*$B$23","v":0},null,{"$f":"(AB21+AB22)*$B$23","v":0},{"$f":"AC22*$B$23","v":0}]
["Rate Base",null,null,{"$f":"SUM(D20+D23)","v":0},{"$f":"SUM(E20+E23)","v":0},null,{"$f":"SUM(G20+G23)","v":0},{"$f":"SUM(H20+H23)","v":0},null,{"$f":"SUM(J20+J23)","v":0},{"$f":"SUM(K20+K23)","v":0},null,{"$f":"SUM(M20+M23)","v":0},{"$f":"SUM(N20+N23)","v":0},null,{"$f":"SUM(P20+P23)","v":0},{"$f":"SUM(Q20+Q23)","v":0},null,{"$f":"SUM(S20+S23)","v":0},{"$f":"SUM(T20+T23)","v":0},null,{"$f":"SUM(V20+V23)","v":0},{"$f":"SUM(W20+W23)","v":0},null,{"$f":"SUM(Y20+Y23)","v":0},{"$f":"SUM(Z20+Z23)","v":0},null,{"$f":"SUM(AB20+AB23)","v":0},{"$f":"SUM(AC20+AC23)","v":0}]
[]
[]
["Deemed ST Debt",null,null,{"$f":"D24*$B$27","v":0},{"$f":"E24*$B$27","v":0},null,{"$f":"G24*$B$27","v":0},{"$f":"H24*$B$27","v":0},null,{"$f":"J24*$B$27","v":0},{"$f":"K24*$B$27","v":0},null,{"$f":"M24*$B$27","v":0},{"$f":"N24*$B$27","v":0},null,{"$f":"P24*$B$27","v":0},{"$f":"Q24*$B$27","v":0},null,{"$f":"S24*$B$27","v":0},{"$f":"T24*$B$27","v":0},null,{"$f":"V24*$B$27","v":0},{"$f":"W24*$B$27","v":0},null,{"$f":"Y24*$B$27","v":0},{"$f":"Z24*$B$27","v":0},null,{"$f":"AB24*$B$27","v":0},{"$f":"AC24*$B$27","v":0}]
["Deemed LT Debt",null,null,{"$f":"D24*$B$28","v":0},{"$f":"E24*$B$28","v":0},null,{"$f":"G24*$B$28","v":0},{"$f":"H24*$B$28","v":0},null,{"$f":"J24*$B$28","v":0},{"$f":"K24*$B$28","v":0},null,{"$f":"M24*$B$28","v":0},{"$f":"N24*$B$28","v":0},null,{"$f":"P24*$B$28","v":0},{"$f":"Q24*$B$28","v":0},null,{"$f":"S24*$B$28","v":0},{"$f":"T24*$B$28","v":0},null,{"$f":"V24*$B$28","v":0},{"$f":"W24*$B$28","v":0},null,{"$f":"Y24*$B$28","v":0},{"$f":"Z24*$B$28","v":0},null,{"$f":"AB24*$B$28","v":0},{"$f":"AC24*$B$28","v":0}]
["Deemed Equity",null,null,{"$f":"D24*$B$29","v":0},{"$f":"E24*$B$29","v":0},null,{"$f":"G24*$B$29","v":0},{"$f":"H24*$B$29","v":0},null,{"$f":"J24*$B$29","v":0},{"$f":"K24*$B$29","v":0},null,{"$f":"M24*$B$29","v":0},{"$f":"N24*$B$29","v":0},null,{"$f":"P24*$B$29","v":0},{"$f":"Q24*$B$29","v":0},null,{"$f":"S24*$B$29","v":0},{"$f":"T24*$B$29","v":0},null,{"$f":"V24*$B$29","v":0},{"$f":"W24*$B$29","v":0},null,{"$f":"Y24*$B$29","v":0},{"$f":"Z24*$B$29","v":0},null,{"$f":"AB24*$B$29","v":0},{"$f":"AC24*$B$29","v":0}]
[]
["ST Interest",null,null,{"$f":"D27*$B31","v":0},0,null,{"$f":"G27*$B31","v":0},0,null,{"$f":"J27*$B31","v":0},0,null,{"$f":"M27*$B31","v":0},0,null,{"$f":"P27*$B31","v":0},0,null,{"$f":"S27*$B31","v":0},0,null,{"$f":"V27*$B31","v":0},0,null,{"$f":"Y27*$B31","v":0},0,null,{"$f":"AB27*$B31","v":0},0]
["LT Interest",null,null,0,0,null,0,0,null,0,0,null,0,0,null,0,0,null,0,0,null,0,0,null,0,0,null,0,0]
["ROE",null,null,0,0,null,0,0,null,0,0,null,0,0,null,0,0,null,0,0,null,0,0,null,0,0,null,0,0]
["Cost of Capital Total",null,null,{"$f":"SUM(D31:D33)","v":0},{"$f":"SUM(E31:E33)","v":0},null,{"$f":"SUM(G31:G33)","v":0},{"$f":"SUM(H31:H33)","v":0},null,{"$f":"SUM(J31:J33)","v":0},{"$f":"SUM(K31:K33)","v":0},null,{"$f":"SUM(M31:M33)","v":0},{"$f":"SUM(N31:N33)","v":0},null,{"$f":"SUM(P31:P33)","v":0},{"$f":"SUM(Q31:Q33)","v":0},null,{"$f":"SUM(S31:S33)","v":0},{"$f":"SUM(T31:T33)","v":0},null,{"$f":"SUM(V31:V33)","v":0},{"$f":"SUM(W31:W33)","v":0},null,{"$f":"SUM(Y31:Y33)","v":0},{"$f":"SUM(Z31:Z33)","v":0},null,{"$f":"SUM(AB31:AB33)","v":0},{"$f":"SUM(AC31:AC33)","v":0}]
[]
["OM&A",null,null,{"$f":"D21+D22","v":0},{"$f":"E22","v":0},null,{"$f":"G21+G22","v":0},{"$f":"H22","v":0},null,{"$f":"J21+J22","v":0},{"$f":"K22","v":0},null,{"$f":"M21+M22","v":0},{"$f":"N22","v":0},null,{"$f":"P21+P22","v":0},{"$f":"Q22","v":0},null,{"$f":"S21+S22","v":0},{"$f":"T22","v":0},null,{"$f":"V21+V22","v":0},{"$f":"W22","v":0},null,{"$f":"Y21+Y22","v":0},{"$f":"Z22","v":0},null,{"$f":"AB21+AB22","v":0},{"$f":"AC22","v":0}]
["Amortization",null,{"$f":"D77","v":0},{"$f":"C37*D$19","v":0},{"$f":"C37*E$19","v":0},{"$f":"E77","v":0},{"$f":"F37*G$19","v":0},{"$f":"F37*H$19","v":0},{"$f":"F77","v":0},{"$f":"I37*J$19","v":0},{"$f":"I37*K$19","v":0},{"$f":"G77","v":0},{"$f":"L37*M$19","v":0},{"$f":"L37*N$19","v":0},{"$f":"H77","v":0},{"$f":"O37*P$19","v":0},{"$f":"O37*Q$19","v":0},{"$f":"I76+I77","v":0},{"$f":"R37*S$19","v":0},{"$f":"R37*T$19","v":0},{"$f":"J76+J77","v":0},{"$f":"U37*V$19","v":0},{"$f":"U37*W$19","v":0},{"$f":"K76+K77","v":0},{"$f":"X37*Y$19","v":0},{"$f":"X37*Z$19","v":0},{"$f":"L76+L77","v":0},{"$f":"AA37*AB$19","v":0},{"$f":"AA37*AC$19","v":0}]
["Grossed-up PILs",null,null,{"$f":"D65","v":0},{"$f":"E65","v":0},null,{"$f":"G65","v":0},{"$f":"H65","v":0},null,{"$f":"J65","v":0},{"$f":"K65","v":0},null,{"$f":"M65","v":0},{"$f":"N65","v":0},null,{"$f":"P65","v":0},{"$f":"Q65","v":0},null,{"$f":"S65","v":0},{"$f":"T65","v":0},null,{"$f":"V65","v":0},{"$f":"W65","v":0},null,{"$f":"Y65","v":0},{"$f":"Z65","v":0},null,{"$f":"AB65","v":0},{"$f":"AC65","v":0}]
[]
["Revenue Requirement",null,null,{"$f":"SUM(D34:D38)","v":0},{"$f":"SUM(E34:E38)","v":0},null,{"$f":"SUM(G34:G38)","v":0},{"$f":"SUM(H34:H38)","v":0},null,{"$f":"SUM(J34:J38)","v":0},{"$f":"SUM(K34:K38)","v":0},null,{"$f":"SUM(M34:M38)","v":0},{"$f":"SUM(N34:N38)","v":0},null,{"$f":"SUM(P34:P38)","v":0},{"$f":"SUM(Q34:Q38)","v":0},null,{"$f":"SUM(S34:S38)","v":0},{"$f":"SUM(T34:T38)","v":0},null,{"$f":"SUM(V34:V38)","v":0},{"$f":"SUM(W34:W38)","v":0},null,{"$f":"SUM(Y34:Y38)","v":0},{"$f":"SUM(Z34:Z38)","v":0},null,{"$f":"SUM(AB34:AB38)","v":0},{"$f":"SUM(AC34:AC38)","v":0}]
[]
[]
["Provincial Rate Protection",null,null,null,{"$f":"E40","v":0},null,null,{"$f":"H40","v":0},null,null,{"$f":"K40","v":0},null,null,{"$f":"N40","v":0},null,null,{"$f":"Q40","v":0},null,null,{"$f":"T40","v":0},null,null,{"$f":"W40","v":0},null,null,{"$f":"Z40","v":0},null,null,{"$f":"AC40","v":0}]
[]
["Monthly Amount Paid by IESO",null,null,null,{"$f":"E43/12","v":0},null,null,{"$f":"H43/12","v":0},null,null,{"$f":"K43/12","v":0},null,null,{"$f":"N43/12","v":0},null,null,{"$f":"Q43/12","v":0},null,null,{"$f":"T43/12","v":0},null,null,{"$f":"W43/12","v":0},null,null,{"$f":"Z43/12","v":0},null,null,{"$f":"AC43/12","v":0}]
[]
["Note 1: The difference between the actual costs of approved eligible investments and revenue received from the IESO should be recorded in a variance account.  The Board may provide "]
["regulatory accounting guidance regarding a variance account either in an individual proceeding or on a generic basis."]
["Note 2: For the 2016 Test Year, Costs and Revenues of the Direct Benefit are to be included in the test year applicant Rate Base and Revenues.  "]
[]
["PILs Calculation"]
[null,null,null,{"$f":"C17","v":2014},null,null,{"$f":"F17","v":2015},null,null,{"$f":"I17","v":2016},null,null,{"$f":"L17","v":2017},null,null,{"$f":"O17","v":"2018 Test Year"},null,null,{"$f":"R17","v":2019},null,null,{"$f":"U17","v":2020},null,null,{"$f":"X17","v":2021},null,null,{"$f":"AA17","v":2022}]
["Income Tax",null,null,"Direct Benefit","Provincial",null,"Direct Benefit","Provincial",null,"Direct Benefit","Provincial",null,"Direct Benefit","Provincial",null,"Direct Benefit","Provincial",null,"Direct Benefit","Provincial",null,"Direct Benefit","Provincial",null,"Direct Benefit","Provincial",null,"Direct Benefit","Provincial"]
[null,null,null,null,null,null,null,null,null,null,null,null,null,null,null,null,null,null,null,null,null,null,null,"Total",null,null,"Total"]
["Net Income - ROE on Rate Base",null,null,{"$f":"D33","v":0},{"$f":"E33","v":0},null,{"$f":"G33","v":0},{"$f":"H33","v":0},null,{"$f":"J33","v":0},{"$f":"K33","v":0},null,{"$f":"M33","v":0},{"$f":"N33","v":0},null,{"$f":"P33","v":0},{"$f":"Q33","v":0},null,{"$f":"S33","v":0},{"$f":"T33","v":0},null,{"$f":"V33","v":0},{"$f":"W33","v":0},null,{"$f":"Y33","v":0},{"$f":"Z33","v":0},null,{"$f":"AB33","v":0},{"$f":"AC33","v":0}]
["Amortization (6% DB and 94% P)",null,null,{"$f":"D37","v":0},{"$f":"E37","v":0},null,{"$f":"G37","v":0},{"$f":"H37","v":0},null,{"$f":"J37","v":0},{"$f":"K37","v":0},null,{"$f":"M37","v":0},{"$f":"N37","v":0},null,{"$f":"P37","v":0},{"$f":"Q37","v":0},null,{"$f":"S37","v":0},{"$f":"T37","v":0},null,{"$f":"V37","v":0},{"$f":"W37","v":0},null,{"$f":"Y37","v":0},{"$f":"Z37","v":0},null,{"$f":"AB37","v":0},{"$f":"AC37","v":0}]
["CCA (6% DB and 94% P)",null,null,{"$f":"-D94*D$19","v":0},{"$f":"-D94*E$19","v":0},null,{"$f":"-E94*G19","v":0},{"$f":"-E94*H$19","v":0},null,{"$f":"-F94*J$19","v":0},{"$f":"-F94*K$19","v":0},null,{"$f":"-G94*M$19","v":0},{"$f":"-G94*N$19","v":0},null,{"$f":"-H94*P$19","v":0},{"$f":"-H94*Q$19","v":0},null,{"$f":"-I94*S$19","v":0},{"$f":"-I94*T$19","v":0},null,{"$f":"-J94*V$19","v":0},{"$f":"-J94*W$19","v":0},null,{"$f":"-K94*Y$19","v":0},{"$f":"-K94*Z$19","v":0},null,{"$f":"-L94*AB$19","v":0},{"$f":"-L94*AC$19","v":0}]
["Taxable income",null,null,{"$f":"SUM(D55:D57)","v":0},{"$f":"SUM(E55:E57)","v":0},null,{"$f":"SUM(G55:G57)","v":0},{"$f":"SUM(H55:H57)","v":0},null,{"$f":"SUM(J55:J57)","v":0},{"$f":"SUM(K55:K57)","v":0},null,{"$f":"SUM(M55:M57)","v":0},{"$f":"SUM(N55:N57)","v":0},null,{"$f":"SUM(P55:P57)","v":0},{"$f":"SUM(Q55:Q57)","v":0},null,{"$f":"SUM(S55:S57)","v":0},{"$f":"SUM(T55:T57)","v":0},null,{"$f":"SUM(V55:V57)","v":0},{"$f":"SUM(W55:W57)","v":0},null,{"$f":"SUM(Y55:Y57)","v":0},{"$f":"SUM(Z55:Z57)","v":0},null,{"$f":"SUM(AB55:AB57)","v":0},{"$f":"SUM(AC55:AC57)","v":0}]
[]
["Tax Rate  (to be entered)"]
[]
["Income Taxes Payable",null,null,{"$f":"D58*D60","v":0},{"$f":"E58*E60","v":0},null,{"$f":"G58*G60","v":0},{"$f":"H58*H60","v":0},null,{"$f":"J58*J60","v":0},{"$f":"K58*K60","v":0},null,{"$f":"M58*M60","v":0},{"$f":"N58*N60","v":0},null,{"$f":"P58*P60","v":0},{"$f":"Q58*Q60","v":0},null,{"$f":"S58*S60","v":0},{"$f":"T58*T60","v":0},null,{"$f":"V58*V60","v":0},{"$f":"W58*W60","v":0},null,{"$f":"Y58*Y60","v":0},{"$f":"Z58*Z60","v":0},null,{"$f":"AB58*AB60","v":0},{"$f":"AC58*AC60","v":0}]
["Gross Up"]
["Income Taxes Payable",null,null,{"$f":"D62/(1-D60)","v":0},{"$f":"E62/(1-E60)","v":0},null,{"$f":"G62/(1-G60)","v":0},{"$f":"H62/(1-H60)","v":0},null,{"$f":"J62/(1-J60)","v":0},{"$f":"K62/(1-K60)","v":0},null,{"$f":"M62/(1-M60)","v":0},{"$f":"N62/(1-N60)","v":0},null,{"$f":"P62/(1-P60)","v":0},{"$f":"Q62/(1-Q60)","v":0},null,{"$f":"S62/(1-S60)","v":0},{"$f":"T62/(1-T60)","v":0},null,{"$f":"V62/(1-V60)","v":0},{"$f":"W62/(1-W60)","v":0},null,{"$f":"Y62/(1-Y60)","v":0},{"$f":"Z62/(1-Z60)","v":0},null,{"$f":"AB62/(1-AB60)","v":0},{"$f":"AC62/(1-AC60)","v":0}]
["Grossed Up PILs",null,null,{"$f":"SUM(D64:D64)","v":0},{"$f":"SUM(E64:E64)","v":0},null,{"$f":"SUM(G64:G64)","v":0},{"$f":"SUM(H64:H64)","v":0},null,{"$f":"SUM(J64:J64)","v":0},{"$f":"SUM(K64:K64)","v":0},null,{"$f":"SUM(M64:M64)","v":0},{"$f":"SUM(N64:N64)","v":0},null,{"$f":"SUM(P64:P64)","v":0},{"$f":"SUM(Q64:Q64)","v":0},null,{"$f":"SUM(S64:S64)","v":0},{"$f":"SUM(T64:T64)","v":0},null,{"$f":"SUM(V64:V64)","v":0},{"$f":"SUM(W64:W64)","v":0},null,{"$f":"SUM(Y64:Y64)","v":0},{"$f":"SUM(Z64:Z64)","v":0},null,{"$f":"SUM(AB64:AB64)","v":0},{"$f":"SUM(AC64:AC64)","v":0}]
[]
[]
[null,null,null,{"$f":"E68-1","v":2014},{"$f":"F68-1","v":2015},{"$f":"G68-1","v":2016},{"$f":"H68-1","v":2017},{"$f":"TestYear","v":2018},{"$f":"H68+1","v":2019},{"$f":"I68+1","v":2020},{"$f":"J68+1","v":2021},{"$f":"K68+1","v":2022}]
["Net Fixed Assets"]
[null,"Enter applicable amortization in years:",25]
["Opening Gross Fixed Assets",null,null,null,{"$f":"D73","v":0},0,0,0,0,0,0,0]
["Gross Capital Additions",null,null,{"$f":"'App.2-FA Proposed REG Invest.'!C62","v":0},{"$f":"'App.2-FA Proposed REG Invest.'!D62","v":0},{"$f":"'App.2-FA Proposed REG Invest.'!E62","v":0},{"$f":"'App.2-FA Proposed REG Invest.'!F62","v":0},{"$f":"'App.2-FA Proposed REG Invest.'!G62","v":0},{"$f":"'App.2-FA Proposed REG Invest.'!H62","v":0},{"$f":"'App.2-FA Proposed REG Invest.'!I62","v":0},{"$f":"'App.2-FA Proposed REG Invest.'!J62","v":0},{"$f":"'App.2-FA Proposed REG Invest.'!K62","v":0}]
["Closing Gross Fixed Assets",null,null,{"$f":"SUM(D71:D72)","v":0},0,0,0,0,0,0,0,0]
[]
["Opening Accumulated Amortization",null,null,null,{"$f":"+D78","v":0},{"$f":"E78","v":0},0,0,0,0,0,0]
["Current Year Amortization (before additions)",null,null,{"$f":"IF(ISERROR(D71/$C$70), 0, D71/$C$70)","v":0},0,0,0,0,0,0,0,0]
["Additions (half year)",null,null,{"$f":"D72/$C$70/2","v":0},{"$f":"E72/$C$70/2","v":0},{"$f":"F72/$C$70/2","v":0},{"$f":"G72/$C$70/2","v":0},{"$f":"H72/$C$70/2","v":0},{"$f":"I72/C70/2","v":0},{"$f":"J72/C70/2","v":0},{"$f":"K72/C70/2","v":0},{"$f":"L72/C70/2","v":0}]
["Closing Accumulated Amortization",null,null,{"$f":"SUM(D75+D76+D77)","v":0},{"$f":"SUM(E75+E76+E77)","v":0},{"$f":"SUM(F75+F76+F77)","v":0},{"$f":"SUM(G75+G76+G77)","v":0},{"$f":"SUM(H75+H76+H77)","v":0},{"$f":"SUM(I75:I77)","v":0},{"$f":"SUM(J75:J77)","v":0},{"$f":"SUM(K75:K77)","v":0},{"$f":"SUM(L75:L77)","v":0}]
[]
["Opening Net Fixed Assets",null,null,{"$f":"D71-D75","v":0},{"$f":"E71-E75","v":0},{"$f":"F71-F75","v":0},{"$f":"G71-G75","v":0},{"$f":"H71-H75","v":0},{"$f":"H81","v":0},{"$f":"I81","v":0},{"$f":"J81","v":0},{"$f":"K81","v":0}]
["Closing Net Fixed Assets",null,null,{"$f":"D73-D78","v":0},0,0,0,0,0,0,0,0]
["Average Net Fixed Assets",null,null,{"$f":"SUM(D80:D81)/2","v":0},0,0,0,0,0,0,0,0]
[]
["UCC for PILs Calculation"]
[null,null,null,{"$f":"D68","v":2014},{"$f":"E68","v":2015},2016,2017,2018,2019,2020,2021,2022]
[]
["Opening UCC",null,null,null,{"$f":"D95","v":0},0,0,0,0,0,0,0]
["Capital Additions (from Appendix 2-FA)",null,null,{"$f":"D72","v":0},0,0,0,0,0,0,0,0]
["UCC Before Half Year Rule",null,null,{"$f":"SUM(D87:D88)","v":0},0,0,0,0,0,0,0,0]
["Half Year Rule (1/2 Additions - Disposals)",null,null,{"$f":"D88/2","v":0},0,0,0,0,0,0,0,0]
["Reduced UCC",null,null,{"$f":"D89-D90","v":0},0,0,0,0,0,0,0,0]
["CCA Rate Class (to be entered)",null,47,{"$f":"C92","v":47},{"$f":"D92","v":47},47,47,47,47,47,47,47]
["CCA Rate  (to be entered)",null,0.08,{"$f":"C93","v":0.08},0.08,0.08,0.08,0.08,0.08,0.08,0.08,0.08]
["CCA",null,null,{"$f":"D91*D93","v":0},0,0,0,0,0,0,0,0]
["Closing UCC",null,null,{"$f":"D89-D94","v":0},0,0,0,0,0,0,0,0]

{"sheet":"App.2-FC Calc of REG Expansion","index":18,"n_rows":95,"n_cols":30,"rows_kept":95,"cut":false,"hidden":false,"merged":[[8,0,8,14],[9,0,9,14],[11,0,11,14],[12,0,12,14],[14,0,14,14],[17,3,17,5],[17,6,17,8],[17,9,17,11],[17,12,17,14],[17,15,17,17],[17,18,17,20],[17,21,17,23],[17,24,17,26],[17,27,17,29],[52,22,52,23],[52,25,52,26],[52,28,52,29],[47,0,47,20],[49,0,49,21],[50,0,50,1],[52,4,52,5],[52,7,52,8],[52,10,52,11],[52,13,52,14],[52,16,52,17],[52,19,52,20]]}
[null,null,null,null,null,null,null,null,null,null,null,null,null,"File Number:",{"$f":"EBNUMBER","v":"EB-2017-0038"}]
[null,null,null,null,null,null,null,null,null,null,null,null,null,"Exhibit:"]
[null,null,null,null,null,null,null,null,null,null,null,null,null,"Tab:"]
[null,null,null,null,null,null,null,null,null,null,null,null,null,"Schedule:"]
[null,null,null,null,null,null,null,null,null,null,null,null,null,"Page:"]
[]
[null,null,null,null,null,null,null,null,null,null,null,null,null,"Date:"]
[]
["Appendix 2-FC"]
["Calculation of Renewable Generation Connection Direct Benefits/Provincial Amount: Renewable Expansion Investments"]
[]
["This table will calculate the distributor/provincial shares of the investments entered in Part B of Appendix 2-FA."]
["Enter values in green shaded cells: WCA percentage, debt percentages, interest rates, kWh, tax rates, amortization period, CCA Class and percentage."]
["For historical investments, enter these variables for your last cost of service test year.  For 2016 and beyond, enter variables as in the application."]
["Rate Riders are not calculated for the Test Year as these assets and costs are already in the distributor's rate base."]
[]
[]
[null,null,null,{"$f":"G18-1","v":2014},null,null,{"$f":"J18-1","v":2015},null,null,{"$f":"M18-1","v":2016},null,null,{"$f":"BridgeYear","v":2017},null,null,{"$f":"CONCATENATE(TestYear,\" Test Year\")","v":"2018 Test Year"},null,null,{"$f":"TestYear+1","v":2019},2016,null,{"$f":"S18+1","v":2020},null,null,{"$f":"V18+1","v":2021},null,null,{"$f":"Y18+1","v":2022}]
[null,null,null,null,"Direct Benefit","Provincial",null,"Direct Benefit","Provincial",null,"Direct Benefit","Provincial",null,"Direct Benefit","Provincial",null,"Direct Benefit","Provincial",null,"Direct Benefit","Provincial",null,"Direct Benefit","Provincial",null,"Direct Benefit","Provincial",null,"Direct Benefit","Provincial"]
[null,null,null,"Total",0.17,0.83,"Total",0.17,0.83,"Total",0.17,0.83,"Total",0.17,0.83,"Total",0.17,0.83,"Total",0.17,0.83,"Total",0.17,0.83,"Total",0.17,0.83,"Total",0.17,0.83]
["Net Fixed Assets (average)",null,null,{"$f":"D82","v":0},{"$f":"D21*E20","v":0},{"$f":"D21*F20","v":0},{"$f":"E82","v":0},{"$f":"G21*H20","v":0},{"$f":"G21*I20","v":0},{"$f":"F82","v":0},{"$f":"J21*K20","v":0},{"$f":"J21*L20","v":0},{"$f":"G82","v":0},{"$f":"M21*N20","v":0},{"$f":"M21*O20","v":0},{"$f":"H82","v":0},{"$f":"P21*Q20","v":0},{"$f":"P21*R20","v":0},{"$f":"I82","v":0},{"$f":"S21*T20","v":0},{"$f":"S21*U20","v":0},{"$f":"J82","v":0},{"$f":"V21*W20","v":0},{"$f":"V21*X20","v":0},{"$f":"K82","v":0},{"$f":"Y21*Z20","v":0},{"$f":"Y21*AA20","v":0},{"$f":"L82","v":0},{"$f":"AB21*AC20","v":0},{"$f":"AB21*AD20","v":0}]
["Incremental OM&A (on-going, N/A for Provincial Recovery)",null,null,{"$f":"'App.2-FA Proposed REG Invest.'!C101","v":0},{"$f":"D22","v":0},null,{"$f":"'App.2-FA Proposed REG Invest.'!D$101","v":0},{"$f":"G22","v":0},null,{"$f":"'App.2-FA Proposed REG Invest.'!E$101","v":0},{"$f":"J22","v":0},null,{"$f":"'App.2-FA Proposed REG Invest.'!F$101","v":0},{"$f":"M22","v":0},null,{"$f":"'App.2-FA Proposed REG Invest.'!G$101","v":0},{"$f":"P22","v":0},null,{"$f":"'App.2-FA Proposed REG Invest.'!H$101","v":0},{"$f":"S22","v":0},null,{"$f":"'App.2-FA Proposed REG Invest.'!I$101","v":0},{"$f":"V22","v":0},null,{"$f":"'App.2-FA Proposed REG Invest.'!J$101","v":0},{"$f":"Y22","v":0},null,{"$f":"'App.2-FA Proposed REG Invest.'!K$101","v":0},{"$f":"AB22","v":0}]
["Incremental OM&A (start-up, applicable for Provincial Recovery)",null,null,{"$f":"'App.2-FA Proposed REG Invest.'!C100","v":0},{"$f":"D23*E20","v":0},{"$f":"D23*F20","v":0},{"$f":"'App.2-FA Proposed REG Invest.'!D$100","v":0},{"$f":"G23*H20","v":0},{"$f":"G23*I20","v":0},{"$f":"'App.2-FA Proposed REG Invest.'!E$100","v":0},{"$f":"J23*K20","v":0},{"$f":"J23*L20","v":0},{"$f":"'App.2-FA Proposed REG Invest.'!F$100","v":0},{"$f":"M23*N20","v":0},{"$f":"M23*O20","v":0},{"$f":"'App.2-FA Proposed REG Invest.'!G$100","v":0},{"$f":"P23*Q20","v":0},{"$f":"P23*R20","v":0},{"$f":"'App.2-FA Proposed REG Invest.'!H$100","v":0},{"$f":"S23*T20","v":0},{"$f":"S23*U20","v":0},{"$f":"'App.2-FA Proposed REG Invest.'!I$100","v":0},{"$f":"V23*W20","v":0},{"$f":"V23*X20","v":0},{"$f":"'App.2-FA Proposed REG Invest.'!J$100","v":0},{"$f":"Y23*Z20","v":0},{"$f":"Y23*AA20","v":0},{"$f":"'App.2-FA Proposed REG Invest.'!K$100","v":0},{"$f":"AB23*AC20","v":0},{"$f":"AB23*AD20","v":0}]
["WCA",null,null,null,{"$f":"(E22+E23)*$B$24","v":0},{"$f":"F23*$B$24","v":0},null,{"$f":"(H22+H23)*$B$24","v":0},{"$f":"I23*$B$24","v":0},null,{"$f":"(K22+K23)*$B$24","v":0},{"$f":"L23*$B$24","v":0},null,{"$f":"(N22+N23)*$B$24","v":0},{"$f":"O23*$B$24","v":0},null,{"$f":"(Q22+Q23)*$B$24","v":0},{"$f":"R23*$B$24","v":0},null,{"$f":"(T22+T23)*$B$24","v":0},{"$f":"U23*$B$24","v":0},null,{"$f":"(W22+W23)*$B$24","v":0},{"$f":"X23*$B$24","v":0},null,{"$f":"(Z22+Z23)*$B$24","v":0},{"$f":"AA23*$B$24","v":0},null,{"$f":"(AC22+AC23)*$B$24","v":0},{"$f":"AD23*$B$24","v":0}]
["Rate Base",null,null,null,{"$f":"SUM(E21+E24)","v":0},{"$f":"SUM(F21+F24)","v":0},null,{"$f":"SUM(H21+H24)","v":0},{"$f":"SUM(I21+I24)","v":0},null,{"$f":"SUM(K21+K24)","v":0},{"$f":"SUM(L21+L24)","v":0},null,{"$f":"SUM(N21+N24)","v":0},{"$f":"SUM(O21+O24)","v":0},null,{"$f":"SUM(Q21+Q24)","v":0},{"$f":"SUM(R21+R24)","v":0},null,{"$f":"SUM(T21+T24)","v":0},{"$f":"SUM(U21+U24)","v":0},null,{"$f":"SUM(W21+W24)","v":0},{"$f":"SUM(X21+X24)","v":0},null,{"$f":"SUM(Z21+Z24)","v":0},{"$f":"SUM(AA21+AA24)","v":0},null,{"$f":"SUM(AC21+AC24)","v":0},{"$f":"SUM(AD21+AD24)","v":0}]
[]
[]
["Deemed ST Debt",null,null,null,{"$f":"E25*$B$28","v":0},{"$f":"F25*$B$28","v":0},null,{"$f":"H25*$B$28","v":0},{"$f":"I25*$B$28","v":0},null,{"$f":"K25*$B$28","v":0},{"$f":"L25*$B$28","v":0},null,{"$f":"N25*$B$28","v":0},{"$f":"O25*$B$28","v":0},null,{"$f":"Q25*$B$28","v":0},{"$f":"R25*$B$28","v":0},null,{"$f":"T25*$B$28","v":0},{"$f":"U25*$B$28","v":0},null,{"$f":"W25*$B$28","v":0},{"$f":"X25*$B$28","v":0},null,{"$f":"Z25*$B$28","v":0},{"$f":"AA25*$B$28","v":0},null,{"$f":"AC25*$B$28","v":0},{"$f":"AD25*$B$28","v":0}]
["Deemed LT Debt",null,null,null,{"$f":"E25*$B$29","v":0},{"$f":"F25*$B$29","v":0},null,{"$f":"H25*$B$29","v":0},{"$f":"I25*$B$29","v":0},null,{"$f":"K25*$B$29","v":0},{"$f":"L25*$B$29","v":0},null,{"$f":"N25*$B$29","v":0},{"$f":"O25*$B$29","v":0},null,{"$f":"Q25*$B$29","v":0},{"$f":"R25*$B$29","v":0},null,{"$f":"T25*$B$29","v":0},{"$f":"U25*$B$29","v":0},null,{"$f":"W25*$B$29","v":0},{"$f":"X25*$B$29","v":0},null,{"$f":"Z25*$B$29","v":0},{"$f":"AA25*$B$29","v":0},null,{"$f":"AC25*$B$29","v":0},{"$f":"AD25*$B$29","v":0}]
["Deemed Equity",null,null,null,{"$f":"E25*$B$30","v":0},{"$f":"F25*$B$30","v":0},null,{"$f":"H25*$B$30","v":0},{"$f":"I25*$B$30","v":0},null,{"$f":"K25*$B$30","v":0},{"$f":"L25*$B$30","v":0},null,{"$f":"N25*$B$30","v":0},{"$f":"O25*$B$30","v":0},null,{"$f":"Q25*$B$30","v":0},{"$f":"R25*$B$30","v":0},null,{"$f":"T25*$B$30","v":0},{"$f":"U25*$B$30","v":0},null,{"$f":"W25*$B$30","v":0},{"$f":"X25*$B$30","v":0},null,{"$f":"Z25*$B$30","v":0},{"$f":"AA25*$B$30","v":0},null,{"$f":"AC25*$B$30","v":0},{"$f":"AD25*$B$30","v":0}]
[]
["ST Interest",null,null,null,{"$f":"E28*$B$32","v":0},{"$f":"F28*$B$32","v":0},null,{"$f":"H28*$B$32","v":0},{"$f":"I28*$B$32","v":0},null,{"$f":"K28*$B$32","v":0},{"$f":"L28*$B$32","v":0},null,{"$f":"N28*$B$32","v":0},{"$f":"O28*$B$32","v":0},null,{"$f":"Q28*$B$32","v":0},{"$f":"R28*$B$32","v":0},null,{"$f":"T28*$B$32","v":0},{"$f":"U28*$B$32","v":0},null,{"$f":"W28*$B$32","v":0},{"$f":"X28*$B$32","v":0},null,{"$f":"Z28*$B$32","v":0},{"$f":"AA28*$B$32","v":0},null,{"$f":"AC28*$B$32","v":0},{"$f":"AD28*$B$32","v":0}]
["LT Interest",null,null,null,{"$f":"E29*$B$33","v":0},{"$f":"F29*$B$33","v":0},null,{"$f":"H29*$B$33","v":0},{"$f":"I29*$B$33","v":0},null,{"$f":"K29*$B$33","v":0},{"$f":"L29*$B$33","v":0},null,{"$f":"N29*$B$33","v":0},{"$f":"O29*$B$33","v":0},null,{"$f":"Q29*$B$33","v":0},{"$f":"R29*$B$33","v":0},null,{"$f":"T29*$B$33","v":0},{"$f":"U29*$B$33","v":0},null,{"$f":"W29*$B$33","v":0},{"$f":"X29*$B$33","v":0},null,{"$f":"Z29*$B$33","v":0},{"$f":"AA29*$B$33","v":0},null,{"$f":"AC29*$B$33","v":0},{"$f":"AD29*$B$33","v":0}]
["ROE",null,null,null,{"$f":"E30*$B$34","v":0},{"$f":"F30*$B$34","v":0},null,{"$f":"H30*$B$34","v":0},{"$f":"I30*$B$34","v":0},null,{"$f":"K30*$B$34","v":0},{"$f":"L30*$B$34","v":0},null,{"$f":"N30*$B$34","v":0},{"$f":"O30*$B$34","v":0},null,{"$f":"Q30*$B$34","v":0},{"$f":"R30*$B$34","v":0},null,{"$f":"T30*$B$34","v":0},{"$f":"U30*$B$34","v":0},null,{"$f":"W30*$B$34","v":0},{"$f":"X30*$B$34","v":0},null,{"$f":"Z30*$B$34","v":0},{"$f":"AA30*$B$34","v":0},null,{"$f":"AC30*$B$34","v":0},{"$f":"AD30*$B$34","v":0}]
["Cost of Capital Total",null,null,null,{"$f":"SUM(E32:E34)","v":0},{"$f":"SUM(F32:F34)","v":0},null,{"$f":"SUM(H32:H34)","v":0},{"$f":"SUM(I32:I34)","v":0},null,{"$f":"SUM(K32:K34)","v":0},{"$f":"SUM(L32:L34)","v":0},null,{"$f":"SUM(N32:N34)","v":0},{"$f":"SUM(O32:O34)","v":0},null,{"$f":"SUM(Q32:Q34)","v":0},{"$f":"SUM(R32:R34)","v":0},null,{"$f":"SUM(T32:T34)","v":0},{"$f":"SUM(U32:U34)","v":0},null,{"$f":"SUM(W32:W34)","v":0},{"$f":"SUM(X32:X34)","v":0},null,{"$f":"SUM(Z32:Z34)","v":0},{"$f":"SUM(AA32:AA34)","v":0},null,{"$f":"SUM(AC32:AC34)","v":0},{"$f":"SUM(AD32:AD34)","v":0}]
[]
["OM&A",null,null,null,{"$f":"E22+E23","v":0},{"$f":"F23","v":0},null,{"$f":"H22+H23","v":0},{"$f":"I23","v":0},null,{"$f":"K22+K23","v":0},{"$f":"L23","v":0},null,{"$f":"N22+N23","v":0},{"$f":"O23","v":0},null,{"$f":"Q22+Q23","v":0},{"$f":"R23","v":0},null,{"$f":"T22+T23","v":0},{"$f":"U23","v":0},null,{"$f":"W22+W23","v":0},{"$f":"X23","v":0},null,{"$f":"Z22+Z23","v":0},{"$f":"AA23","v":0},null,{"$f":"AC22+AC23","v":0},{"$f":"AD23","v":0}]
["Amortization",null,null,{"$f":"D78","v":0},{"$f":"D38*E$20","v":0},{"$f":"D38*F$20","v":0},{"$f":"E78","v":0},{"$f":"G38*H$20","v":0},{"$f":"G38*I$20","v":0},{"$f":"F78","v":0},{"$f":"J38*K$20","v":0},{"$f":"J38*L$20","v":0},{"$f":"G78","v":0},{"$f":"M38*N$20","v":0},{"$f":"M38*O$20","v":0},{"$f":"H76+H77","v":0},{"$f":"P38*Q$20","v":0},{"$f":"P38*R$20","v":0},{"$f":"I76+I77","v":0},{"$f":"S38*T$20","v":0},{"$f":"S38*U$20","v":0},{"$f":"J76+J77","v":0},{"$f":"V38*W$20","v":0},{"$f":"V38*X$20","v":0},{"$f":"K76+K77","v":0},{"$f":"Y38*Z$20","v":0},{"$f":"Y38*AA$20","v":0},{"$f":"L76+L77","v":0},{"$f":"AB38*AC$20","v":0},{"$f":"AB38*AD$20","v":0}]
["Grossed-up PILs",null,null,null,{"$f":"E66","v":0},{"$f":"F66","v":0},null,{"$f":"H66","v":0},{"$f":"I66","v":0},null,{"$f":"K66","v":0},{"$f":"L66","v":0},null,{"$f":"N66","v":0},{"$f":"O66","v":0},null,{"$f":"Q66","v":0},{"$f":"R66","v":0},null,{"$f":"T66","v":0},{"$f":"U66","v":0},null,{"$f":"W66","v":0},{"$f":"X66","v":0},null,{"$f":"Z66","v":0},{"$f":"AA66","v":0},null,{"$f":"AC66","v":0},{"$f":"AD66","v":0}]
[]
["Revenue Requirement",null,null,null,{"$f":"SUM(E35:E39)","v":0},{"$f":"SUM(F35:F39)","v":0},null,{"$f":"SUM(H35:H39)","v":0},{"$f":"SUM(I35:I39)","v":0},null,{"$f":"SUM(K35:K39)","v":0},{"$f":"SUM(L35:L39)","v":0},null,{"$f":"SUM(N35:N39)","v":0},{"$f":"SUM(O35:O39)","v":0},null,{"$f":"SUM(Q35:Q39)","v":0},{"$f":"SUM(R35:R39)","v":0},null,{"$f":"SUM(T35:T39)","v":0},{"$f":"SUM(U35:U39)","v":0},null,{"$f":"SUM(W35:W39)","v":0},{"$f":"SUM(X35:X39)","v":0},null,{"$f":"SUM(Z35:Z39)","v":0},{"$f":"SUM(AA35:AA39)","v":0},null,{"$f":"SUM(AC35:AC39)","v":0},{"$f":"SUM(AD35:AD39)","v":0}]
[]
[]
["Provincial Rate Protection",null,null,null,null,{"$f":"F41","v":0},null,null,{"$f":"I41","v":0},null,null,{"$f":"L41","v":0},null,null,{"$f":"O41","v":0},null,null,{"$f":"R41","v":0},null,null,{"$f":"U41","v":0},null,null,{"$f":"X41","v":0},null,null,{"$f":"AA41","v":0},null,null,{"$f":"AD41","v":0}]
[]
["Monthly Amount Paid by IESO",null,null,null,null,{"$f":"F44/12","v":0},null,null,{"$f":"I44/12","v":0},null,null,{"$f":"L44/12","v":0},null,null,{"$f":"O44/12","v":0},null,null,{"$f":"R44/12","v":0},null,null,{"$f":"U44/12","v":0},null,null,{"$f":"X44/12","v":0},null,null,{"$f":"AA44/12","v":0},null,null,{"$f":"AD44/12","v":0}]
[]
["Note 1: The difference between the actual costs of approved eligible investments and revenue received from the IESO should be recorded in a variance account.  The Board may provide "]
["regulatory accounting guidance regarding a variance account either in an individual proceeding or on a generic basis."]
["Note 2: For the 2016 Test Year, Costs and Revenues of the Direct Benefit are to be included in the test year applicant Rate Base and Revenues."]
[]
["PILs Calculation"]
[null,null,null,null,{"$f":"D18","v":2014},null,null,{"$f":"G18","v":2015},null,null,{"$f":"J18","v":2016},null,null,{"$f":"M18","v":2017},null,null,{"$f":"P18","v":"2018 Test Year"},null,null,{"$f":"S18","v":2019},null,null,{"$f":"V18","v":2020},null,null,{"$f":"Y18","v":2021},null,null,{"$f":"AB18","v":2022}]
["Income Tax",null,null,null,"Direct Benefit","Provincial",null,"Direct Benefit","Provincial",null,"Direct Benefit","Provincial",null,"Direct Benefit","Provincial",null,"Direct Benefit","Provincial",null,"Direct Benefit","Provincial",null,"Direct Benefit","Provincial",null,"Direct Benefit","Provincial",null,"Direct Benefit","Provincial"]
[null,null,null,null,null,null,null,null,null,null,null,null,null,null,null,null,null,null,null,null,null,"Total",null,null,"Total",null,null,"Total"]
["Net Income - ROE on Rate Base",null,null,null,{"$f":"E34","v":0},{"$f":"F34","v":0},null,{"$f":"H34","v":0},{"$f":"I34","v":0},null,{"$f":"K34","v":0},{"$f":"L34","v":0},null,{"$f":"N34","v":0},{"$f":"O34","v":0},null,{"$f":"Q34","v":0},{"$f":"R34","v":0},null,{"$f":"T34","v":0},{"$f":"U34","v":0},null,{"$f":"W34","v":0},{"$f":"X34","v":0},null,{"$f":"Z34","v":0},{"$f":"AA34","v":0},null,{"$f":"AC34","v":0},{"$f":"AD34","v":0}]
["Amortization (17% DB and 83% P)",null,null,null,{"$f":"E38","v":0},{"$f":"F38","v":0},null,{"$f":"H38","v":0},{"$f":"I38","v":0},null,{"$f":"K38","v":0},{"$f":"L38","v":0},null,{"$f":"N38","v":0},{"$f":"O38","v":0},null,{"$f":"Q38","v":0},{"$f":"R38","v":0},null,{"$f":"T38","v":0},{"$f":"U38","v":0},null,{"$f":"W38","v":0},{"$f":"X38","v":0},null,{"$f":"Z38","v":0},{"$f":"AA38","v":0},null,{"$f":"AC38","v":0},{"$f":"AD38","v":0}]
["CCA (17% DB and 83% P)",null,null,null,{"$f":"-D94*E$20","v":0},{"$f":"-D94*F$20","v":0},null,{"$f":"-E94*H$20","v":0},{"$f":"-E94*I$20","v":0},null,{"$f":"-F94*K$20","v":0},{"$f":"-F94*L$20","v":0},null,{"$f":"-G94*N$20","v":0},{"$f":"-G94*O$20","v":0},null,{"$f":"-H94*Q$20","v":0},{"$f":"-H94*R$20","v":0},null,{"$f":"-I94*T$20","v":0},{"$f":"-I94*U$20","v":0},null,{"$f":"-J94*W$20","v":0},{"$f":"-J94*X$20","v":0},null,{"$f":"-K94*Z$20","v":0},{"$f":"-K94*AA$20","v":0},null,{"$f":"-L94*AC$20","v":0},{"$f":"-L94*AD$20","v":0}]
["Taxable income",null,null,null,{"$f":"SUM(E56:E58)","v":0},{"$f":"SUM(F56:F58)","v":0},null,{"$f":"SUM(H56:H58)","v":0},{"$f":"SUM(I56:I58)","v":0},null,{"$f":"SUM(K56:K58)","v":0},{"$f":"SUM(L56:L58)","v":0},null,{"$f":"SUM(N56:N58)","v":0},{"$f":"SUM(O56:O58)","v":0},null,{"$f":"SUM(Q56:Q58)","v":0},{"$f":"SUM(R56:R58)","v":0},null,{"$f":"SUM(T56:T58)","v":0},{"$f":"SUM(U56:U58)","v":0},null,{"$f":"SUM(W56:W58)","v":0},{"$f":"SUM(X56:X58)","v":0},null,{"$f":"SUM(Z56:Z58)","v":0},{"$f":"SUM(AA56:AA58)","v":0},null,{"$f":"SUM(AC56:AC58)","v":0},{"$f":"SUM(AD56:AD58)","v":0}]
[]
["Tax Rate  (to be entered)"]
[]
["Income Taxes Payable",null,null,null,{"$f":"E59*E61","v":0},{"$f":"F59*F61","v":0},null,{"$f":"H59*H61","v":0},{"$f":"I59*I61","v":0},null,{"$f":"K59*K61","v":0},{"$f":"L59*L61","v":0},null,{"$f":"N59*N61","v":0},{"$f":"O59*O61","v":0},null,{"$f":"Q59*Q61","v":0},{"$f":"R59*R61","v":0},null,{"$f":"T59*T61","v":0},{"$f":"U59*U61","v":0},null,{"$f":"W59*W61","v":0},{"$f":"X59*X61","v":0},null,{"$f":"Z59*Z61","v":0},{"$f":"AA59*AA61","v":0},null,{"$f":"AC59*AC61","v":0},{"$f":"AD59*AD61","v":0}]
["Gross Up"]
["Income Taxes Payable",null,null,null,{"$f":"E63/(1-E61)","v":0},{"$f":"F63/(1-F61)","v":0},null,{"$f":"H63/(1-H61)","v":0},{"$f":"I63/(1-I61)","v":0},null,{"$f":"K63/(1-K61)","v":0},{"$f":"L63/(1-L61)","v":0},null,{"$f":"N63/(1-N61)","v":0},{"$f":"O63/(1-O61)","v":0},null,{"$f":"Q63/(1-Q61)","v":0},{"$f":"R63/(1-R61)","v":0},null,{"$f":"T63/(1-T61)","v":0},{"$f":"U63/(1-U61)","v":0},null,{"$f":"W63/(1-W61)","v":0},{"$f":"X63/(1-X61)","v":0},null,{"$f":"Z63/(1-Z61)","v":0},{"$f":"AA63/(1-AA61)","v":0},null,{"$f":"AC63/(1-AC61)","v":0},{"$f":"AD63/(1-AD61)","v":0}]
["Grossed Up PILs",null,null,null,{"$f":"SUM(E65:E65)","v":0},{"$f":"SUM(F65:F65)","v":0},null,{"$f":"SUM(H65:H65)","v":0},{"$f":"SUM(I65:I65)","v":0},null,{"$f":"SUM(K65:K65)","v":0},{"$f":"SUM(L65:L65)","v":0},null,{"$f":"SUM(N65:N65)","v":0},{"$f":"SUM(O65:O65)","v":0},null,{"$f":"SUM(Q65:Q65)","v":0},{"$f":"SUM(R65:R65)","v":0},null,{"$f":"SUM(T65:T65)","v":0},{"$f":"SUM(U65:U65)","v":0},null,{"$f":"SUM(W65:W65)","v":0},{"$f":"SUM(X65:X65)","v":0},null,{"$f":"SUM(Z65:Z65)","v":0},{"$f":"SUM(AA65:AA65)","v":0},null,{"$f":"SUM(AC65:AC65)","v":0},{"$f":"SUM(AD65:AD65)","v":0}]
[]
[]
["Net Fixed Assets",null,null,2011,2012,2013,2014,2015,2016,2017,2018,2019]
[null,"Enter applicable amortization in years:",25]
["Opening Gross Fixed Assets",null,null,null,{"$f":"D73","v":0},0,0,0,0,0,0,0]
["Gross Capital Additions",null,null,{"$f":"'App.2-FA Proposed REG Invest.'!C99","v":0},{"$f":"'App.2-FA Proposed REG Invest.'!D99","v":0},{"$f":"'App.2-FA Proposed REG Invest.'!E99","v":0},{"$f":"'App.2-FA Proposed REG Invest.'!F99","v":0},{"$f":"'App.2-FA Proposed REG Invest.'!G99","v":0},{"$f":"'App.2-FA Proposed REG Invest.'!H99","v":0},{"$f":"'App.2-FA Proposed REG Invest.'!I99","v":0},{"$f":"'App.2-FA Proposed REG Invest.'!J99","v":0},{"$f":"'App.2-FA Proposed REG Invest.'!K99","v":0}]
["Closing Gross Fixed Assets",null,null,{"$f":"SUM(D71:D72)","v":0},0,0,0,0,0,0,0,0]
[]
["Opening Accumulated Amortization",null,null,null,{"$f":"+D78","v":0},{"$f":"E78","v":0},0,0,0,0,0,0]
["Current Year Amortization (before additions)",null,null,null,{"$f":"IF(ISERROR(E71/$C$70), 0, E71/$C$70)","v":0},{"$f":"IF(ISERROR(F71/$C$70), 0, F71/$C$70)","v":0},{"$f":"IF(ISERROR(G71/$C$70), 0, G71/$C$70)","v":0},{"$f":"H71/$C$70","v":0},{"$f":"I71/$C$70","v":0},{"$f":"J71/$C$70","v":0},{"$f":"K71/$C$70","v":0},{"$f":"L71/$C$70","v":0}]
["Additions (half year)",null,null,{"$f":"D72/C70/2","v":0},{"$f":"E72/C70/2","v":0},{"$f":"F72/C70/2","v":0},{"$f":"G72/C70/2","v":0},{"$f":"H72/C70/2","v":0},{"$f":"I72/C70/2","v":0},{"$f":"J72/C70/2","v":0},{"$f":"K72/C70/2","v":0},{"$f":"L72/C70/2","v":0}]
["Closing Accumulated Amortization",null,null,{"$f":"SUM(D75+D77)","v":0},{"$f":"SUM(E75:E77)","v":0},0,0,0,0,0,0,0]
[]
["Opening Net Fixed Assets",null,null,{"$f":"D71-D75","v":0},{"$f":"E71-E75","v":0},{"$f":"F71-F75","v":0},{"$f":"G71-G75","v":0},{"$f":"G81","v":0},{"$f":"H81","v":0},{"$f":"I81","v":0},{"$f":"J81","v":0},{"$f":"K81","v":0}]
["Closing Net Fixed Assets",null,null,{"$f":"D73-D78","v":0},0,0,0,0,0,0,0,0]
["Average Net Fixed Assets",null,null,{"$f":"SUM(D80:D81)/2","v":0},0,0,0,0,0,0,0,0]
[]
["UCC for PILs Calculation"]
[null,null,null,2014,2014,2014,2014,2015,2016,2017,2018,2019]
[]
["Opening UCC",null,null,null,{"$f":"D95","v":0},0,0,0,0,0,0,0]
["Capital Additions (from Appendix 2-FA)",null,null,{"$f":"D72","v":0},0,0,0,0,0,0,0,0]
["UCC Before Half Year Rule",null,null,{"$f":"SUM(D87:D88)","v":0},0,0,0,0,0,0,0,0]
["Half Year Rule (1/2 Additions - Disposals)",null,null,{"$f":"D88/2","v":0},0,0,0,0,0,0,0,0]
["Reduced UCC",null,null,{"$f":"D89-D90","v":0},0,0,0,0,0,0,0,0]
["CCA Rate Class (to be entered)",null,47,{"$f":"$C$92","v":47},{"$f":"$C$92","v":47},47,47,47,47,47,47,47]
["CCA Rate  (to be entered)",null,0.08,{"$f":"$C$93","v":0.08},{"$f":"$C$93","v":0.08},0.08,0.08,0.08,0.08,0.08,0.08,0.08]
["CCA",null,null,{"$f":"D91*D$93","v":0},0,0,0,0,0,0,0,0]
["Closing UCC",null,null,{"$f":"D89-D94","v":0},0,0,0,0,0,0,0,0]

{"sheet":"App.2-G SQI","index":19,"n_rows":40,"n_cols":16,"rows_kept":40,"cut":false,"hidden":false,"merged":[[37,4,37,5],[38,4,38,5],[39,4,39,5],[29,0,29,3],[30,0,30,3],[31,0,31,3],[32,0,32,3],[33,0,33,3],[34,0,34,3],[35,0,35,3],[36,0,36,3],[37,0,37,3],[38,0,38,3],[39,0,39,3],[32,4,32,5],[33,4,33,5],[34,4,34,5],[35,4,35,5],[36,4,36,5],[28,4,28,5],[29,4,29,5],[30,4,30,5],[31,4,31,5],[28,0,28,3],[6,14,6,15],[14,11,14,15],[20,11,20,14],[21,11,21,14],[19,0,19,15],[8,0,8,15],[9,0,9,15],[10,0,10,15],[12,0,12,15],[20,1,20,4],[20,6,20,9],[23,0,23,10],[24,0,24,10],[26,0,26,10],[21,1,21,4],[21,6,21,9],[14,0,15,0],[14,1,14,5],[14,6,14,10],[0,14,0,15],[1,14,1,15],[2,14,2,15],[3,14,3,15],[4,14,4,15]]}
[null,null,null,null,null,null,null,null,null,null,null,null,"File Number:",null,{"$f":"EBNUMBER","v":"EB-2017-0038"}]
[null,null,null,null,null,null,null,null,null,null,null,null,"Exhibit:",null,2]
[null,null,null,null,null,null,null,null,null,null,null,null,"Tab:",null,7]
[null,null,null,null,null,null,null,null,null,null,null,null,"Schedule:"]
[null,null,null,null,null,null,null,null,null,null,null,null,"Page:",null,66]
[]
[null,null,null,null,null,null,null,null,null,null,null,null,"Date:",null,"Sept 12, 2017"]
[]
["Appendix 2-G"]
["Service Reliability and Quality Indicators"]
["2012-2016"]
[]
["Service Reliability"]
[]
["Index","Including outages caused by loss of supply",null,null,null,null,"Excluding outages caused by loss of supply",null,null,null,null,"Excluding Major Event Days"]
[null,{"$f":"TestYear-6","v":2012},{"$f":"TestYear-5","v":2013},{"$f":"TestYear-4","v":2014},{"$f":"TestYear-3","v":2015},{"$f":"TestYear-2","v":2016},{"$f":"B16","v":2012},2013,2014,2015,2016,2012,2013,2014,2015,2016]
["SAIDI ",2.56,1.23,2.21,3.85,3.96,1.47,0.41,0.59,0.73,1.88,1.47,0.41,0.59,0.73,3]
["SAIFI",0.82,0.51,0.91,1.05,1.1299999999999999,0.31,0.2,0.3,0.48,0.47,0.31,0.2,0.3,0.48,0.74]
[]
["5 Year Historical Average"]
["SAIDI ",null,null,null,null,{"$f":"IF(ISERROR(AVERAGE(B17:F17)), \"\", AVERAGE(B17:F17))","v":2.7619999999999996},null,null,null,null,{"$f":"IF(ISERROR(AVERAGE(G17:K17)), \"\", AVERAGE(G17:K17))","v":1.016},null,null,null,null,{"$f":"IF(ISERROR(AVERAGE(L17:P17)), \"\", AVERAGE(L17:P17))","v":1.2399999999999998}]
["SAIFI",null,null,null,null,{"$f":"IF(ISERROR(AVERAGE(B18:F18)), \"\", AVERAGE(B18:F18))","v":0.88400000000000001},null,null,null,null,{"$f":"IF(ISERROR(AVERAGE(G18:K18)), \"\", AVERAGE(G18:K18))","v":0.35199999999999998},null,null,null,null,{"$f":"IF(ISERROR(AVERAGE(L18:P18)), \"\", AVERAGE(L18:P18))","v":0.40600000000000003}]
[]
["SAIDI = System Average Interruption Duration Index"]
["SAIFI = System Average Interruption Frequency Index "]
[]
["Service Quality"]
[]
["Indicator",null,null,null,"OEB Minimum Standard",null,{"$f":"B16","v":2012},{"$f":"C16","v":2013},{"$f":"D16","v":2014},{"$f":"E16","v":2015},{"$f":"F16","v":2016}]
["Low Voltage Connections",null,null,null,0.9,null,0.98799999999999999,0.98799999999999999,0.99399999999999999,0.98399999999999999,0.996]
["High Voltage Connections",null,null,null,0.9,null,"n/a","n/a","n/a","n/a","n/a"]
["Telephone Accessibility",null,null,null,0.65,null,0.94599999999999995,0.95799999999999996,0.95499999999999996,0.98399999999999999,0.98399999999999999]
["Appointments Met",null,null,null,0.9,null,1,1,1,1,1]
["Written Response to Enquires",null,null,null,0.8,null,1,0.98799999999999999,0.98599999999999999,1,1]
["Emergency Urban Response",null,null,null,0.8,null,0.90500000000000003,1,1,1,1]
["Emergency Rural Response",null,null,null,0.8,null,"n/a","n/a","n/a","n/a","n/a"]
["Telephone Call Abandon Rate",null,null,null,0.1,null,6.2E-2,4.2000000000000003E-2,4.3999999999999997E-2,1.6E-2,1.6E-2]
["Appointment Scheduling",null,null,null,0.9,null,1,1,0.94499999999999995,0.95799999999999996,0.99199999999999999]
["Rescheduling a Missed Appointment",null,null,null,1,null,0,0,0,0,0,"**no missed appointments so none needed to be rescheduled"]
["Reconnection Performance Standard",null,null,null,0.85,null,1,1,1,1,1]

{"sheet":"App.2-H_Other_Oper_Rev","index":20,"n_rows":164,"n_cols":9,"rows_kept":164,"cut":false,"hidden":false,"merged":[[56,1,56,8],[61,0,61,1],[62,0,62,1],[39,0,40,8],[45,0,45,1],[51,0,51,1],[47,0,47,1],[48,0,48,1],[49,0,49,1],[50,0,50,1],[43,3,43,4],[59,3,59,4],[46,0,46,1],[36,0,36,8],[23,0,23,1],[24,0,24,1],[8,0,8,8],[9,0,9,8],[21,0,21,8],[22,0,22,1],[31,2,31,8],[32,2,33,8],[25,0,25,1],[26,0,26,1],[29,0,29,1],[30,0,30,1],[31,0,31,1],[32,0,32,1],[11,3,11,4],[114,0,114,1],[115,0,115,1],[116,0,116,1],[98,0,98,1],[99,0,99,1],[100,0,100,1],[101,0,101,1],[102,0,102,1],[117,0,117,1],[118,0,118,1],[119,0,119,1],[120,0,120,1],[125,1,125,8],[163,1,163,8],[155,0,155,1],[156,0,156,1],[157,0,157,1],[158,0,158,1],[129,3,129,4],[150,3,150,4],[136,0,136,1],[137,0,137,1],[142,1,142,8],[152,0,152,1],[131,0,131,1],[132,0,132,1],[133,0,133,1],[134,0,134,1],[135,0,135,1],[78,3,78,4],[95,3,95,4],[112,3,112,4],[74,1,74,8],[80,0,80,1],[81,0,81,1],[82,0,82,1],[83,0,83,1],[103,0,103,1],[108,1,108,8],[84,0,84,1],[85,0,85,1],[86,0,86,1],[91,1,91,8],[97,0,97,1],[63,0,63,1],[64,0,64,1],[65,0,65,1],[66,0,66,1],[67,0,67,1]]}
[null,null,null,null,null,null,null,"File Number:",{"$f":"EBNUMBER","v":"EB-2017-0038"}]
[null,null,null,null,null,null,null,"Exhibit:",3]
[null,null,null,null,null,null,null,"Tab:",3]
[null,null,null,null,null,null,null,"Schedule:"]
[null,null,null,null,null,null,null,"Page:",16]
[]
[null,null,null,null,null,null,null,"Date:","Sept 12, 2017"]
[]
["Appendix 2-H"]
["Other Operating Revenue"]
[]
["USoA #","USoA Description",{"$f":"G13-3 & \" Actual\" & CHAR(178)","v":"2013 Actual²"},"2014 Actuals",null,{"$f":"F13 & \" Actual\" & CHAR(178)","v":"2015 Actual²"},{"$f":"\"Actual Year\"","v":"Actual Year"},{"$f":"\"Bridge Year\"","v":"Bridge Year"},"Test Year"]
[null,null,2013,"2014 CGAAP","2014 MIFRS",{"$f":"G13-1","v":2015},{"$f":"H13-1","v":2016},{"$f":"BridgeYear","v":2017},{"$f":"TestYear","v":2018}]
[null,"Reporting Basis"]
[4235,"Specific Service Charges",{"$f":"SUM([14]Sheet1!$G$9:$G$10)","v":113884.98},{"$f":"SUM([14]Sheet1!$H$9:$H$10)","v":113765},{"$f":"D15","v":113765},{"$f":"SUM([14]Sheet1!$I$9:$I$10)","v":103720},{"$f":"SUM([14]Sheet1!$J$9:$J$10)","v":105040},{"$f":"SUM([14]Sheet1!$D$9:$D$10)","v":87100},{"$f":"SUM([14]Sheet1!$E$9:$E$10)","v":98161.7}]
[4225,"Late Payment Charges",{"$f":"[14]Sheet1!$G$8","v":117341.67},{"$f":"[14]Sheet1!$H$8","v":109434.71},{"$f":"D16","v":109434.71},{"$f":"[14]Sheet1!$I$8","v":112833.85},{"$f":"[14]Sheet1!$J$8","v":134656.29},{"$f":"[14]Sheet1!$D$8","v":138977.92000000001},145947]
[4082,"Retail Services Revenues",{"$f":"[14]Sheet1!$G$4","v":16279.5},{"$f":"[14]Sheet1!$H$4","v":14815},{"$f":"D17","v":14815},{"$f":"[14]Sheet1!$I$4","v":18983},{"$f":"[14]Sheet1!$J$4","v":14779},{"$f":"[14]Sheet1!$D$4","v":13067},{"$f":"[14]Sheet1!$E$4","v":14726.509}]
["etc."]
[]
[]
[]
[]
["Specific Service Charges",null,{"$f":"C15","v":113884.98},113765,113765,103720,105040,87100,{"$f":"I15","v":98161.7}]
["Late Payment Charges",null,{"$f":"C16","v":117341.67},109434.71,109434.71,112833.85,134656.29,138977.92000000001,{"$f":"I16","v":145947}]
["Other Operating Revenues",null,{"$f":"455405-C23-C24-C26","v":201274.35000000003},{"$f":"454285-D23-D24-D26","v":190335.28999999998},{"$f":"D25","v":190335.28999999998},{"$f":"469723-F23-F24-F26","v":216541.15},{"$f":"556582-G23-G24-G26","v":252085.70999999996},{"$f":"454735-H23-H24-H26","v":210965.08},{"$f":"494448-I23-I24-I26","v":230879.3}]
["Other Income or Deductions",null,22904,40750,{"$f":"D26","v":40750},36628,64800,17692,19460]
["Total",null,{"$f":"SUM(C23:C26)","v":455405},454285,454285,469723,556582,454735,494448]
[]
["Description",null,"Account(s)"]
["Specific Service Charges:",null,4235]
["Late Payment Charges:",null,4225]
["Other Distribution Revenues:",null,"4080, 4082, 4084, 4090, 4205, 4210, 4215, 4220, 4240, 4245"]
["Other Income and Expenses:",null,"4305, 4310, 4315, 4320, 4325, 4330, 4335, 4340, 4345, 4350, 4355, 4360, 4365, 4370, 4375, 4380, 4385, 4390, 4395, 4398, 4405, 4415"]
[]
[]
["Note: Add all applicable accounts listed above to the table and include all relevant information."]
[]
["Account Breakdown Details"]
[]
["For each \"Other Operating Revenue\" and \"Other Income or Deductions\" Account, a detailed breakdown of the account components is required.  See the example below for Account 4405, Interest and Dividend Income."]
[]
[]
[]
[null,null,{"$f":"G45-3 & \" Actual\" & CHAR(178)","v":"2013 Actual²"},"2014 Actuals",null,{"$f":"F45 & \" Actual\" & CHAR(178)","v":"2015 Actual²"},{"$f":"\"Actual Year\"","v":"Actual Year"},{"$f":"\"Bridge Year\"","v":"Bridge Year"},"Test Year"]
[null,null,2013,"2014 CGAAP","2014 MIFRS",{"$f":"G45-1","v":2015},{"$f":"H45-1","v":2016},{"$f":"BridgeYear","v":2017},{"$f":"TestYear","v":2018}]
["Reporting Basis"]
["SSS ADMIN CHG RESIDENTL",null,64324.06,6426.17,64246.17,64288.31,66018.63,57503.46,57928.83]
[]
[]
[]
[]
["Total",null,{"$f":"SUM(C47:C51)","v":64324.06},6426.17,64246.17,64288.31,66018.63,57503.46,57928.83]
[]
[]
["Notes:"]
[1,"List and specify any other interest revenue."]
[2,"In the transition year to IFRS, the applicant is to present information in both MIFRS and CGAAP.  For the typical applicant that adopted IFRS on January 1, 2015, 2014 must be presented in both a CGAAP and MIFRS basis."]
[]
[]
[null,null,{"$f":"G61-3 & \" Actual\" & CHAR(178)","v":"2013 Actual²"},"2014 Actuals",null,{"$f":"F61 & \" Actual\" & CHAR(178)","v":"2015 Actual²"},{"$f":"\"Actual Year\"","v":"Actual Year"},{"$f":"\"Bridge Year\"","v":"Bridge Year"},"Test Year"]
[null,null,2013,"2014 CGAAP","2014 MIFRS",{"$f":"G61-1","v":2015},{"$f":"H61-1","v":2016},{"$f":"BridgeYear","v":2017},{"$f":"TestYear","v":2018}]
["Reporting Basis"]
["RETAIL SERVCE REV-RETAIL",null,{"$f":"[14]Sheet1!$G$4","v":16279.5},{"$f":"[14]Sheet1!$H$4","v":14815},{"$f":"[14]Sheet1!$H$4","v":14815},{"$f":"[14]Sheet1!$I$4","v":18983},{"$f":"[14]Sheet1!$J$4","v":14779},{"$f":"[14]Sheet1!$D$4","v":13067},{"$f":"[14]Sheet1!$E$4","v":14726.509}]
[]
[]
[]
[]
["Total",null,{"$f":"SUM(C63:C67)","v":16279.5},14815,14815,18983,14779,13067,14726.509]
[]
[]
[]
[]
["Notes:"]
[1,"List and specify any other interest revenue."]
[2,"In the transition year to IFRS, the applicant is to present information in both MIFRS and CGAAP.  For the typical applicant that adopted IFRS on January 1, 2015, 2014 must be presented in both a CGAAP and MIFRS basis."]
[]
[]
[]
[null,null,{"$f":"G80-3 & \" Actual\" & CHAR(178)","v":"2013 Actual²"},"2014 Actuals",null,{"$f":"F80 & \" Actual\" & CHAR(178)","v":"2015 Actual²"},{"$f":"\"Actual Year\"","v":"Actual Year"},{"$f":"\"Bridge Year\"","v":"Bridge Year"},"Test Year"]
[null,null,2013,"2014 CGAAP","2014 MIFRS",{"$f":"G80-1","v":2015},{"$f":"H80-1","v":2016},{"$f":"BridgeYear","v":2017},{"$f":"TestYear","v":2018}]
["Reporting Basis"]
["SERVC STR REQUEST FEE",null,{"$f":"[14]Sheet1!$G$5","v":7640.4},{"$f":"[14]Sheet1!$H$5","v":7069.95},{"$f":"[14]Sheet1!$H$5","v":7069.95},{"$f":"[14]Sheet1!$I$5","v":8670.25},{"$f":"[14]Sheet1!$J$5","v":6461.05},{"$f":"[14]Sheet1!$D$5","v":5547.7},{"$f":"[14]Sheet1!$E$5","v":6252.2578999999996}]
[]
[]
[]
[]
["Total",null,{"$f":"SUM(C82:C86)","v":7640.4},7069.95,7069.95,8670.25,6461.05,5547.7,6252.2578999999996]
[]
[]
["Notes:"]
[1,"List and specify any other interest revenue."]
[2,"In the transition year to IFRS, the applicant is to present information in both MIFRS and CGAAP.  For the typical applicant that adopted IFRS on January 1, 2015, 2014 must be presented in both a CGAAP and MIFRS basis."]
[]
[]
[]
[null,null,{"$f":"G97-3 & \" Actual\" & CHAR(178)","v":"2013 Actual²"},"2014 Actuals",null,{"$f":"F97 & \" Actual\" & CHAR(178)","v":"2015 Actual²"},{"$f":"\"Actual Year\"","v":"Actual Year"},{"$f":"\"Bridge Year\"","v":"Bridge Year"},"Test Year"]
[null,null,2013,"2014 CGAAP","2014 MIFRS",{"$f":"G97-1","v":2015},{"$f":"H97-1","v":2016},{"$f":"BridgeYear","v":2017},{"$f":"TestYear","v":2018}]
["Reporting Basis"]
["RENT FR EL PROP-POLE RENT",null,{"$f":"[14]Sheet1!$G$6","v":103070.55},{"$f":"[14]Sheet1!$H$6","v":104876.83},{"$f":"[14]Sheet1!$H$6","v":104876.83},{"$f":"[14]Sheet1!$I$6","v":92903.82},{"$f":"[14]Sheet1!$J$6","v":103987.32},{"$f":"[14]Sheet1!$D$6","v":117381.94},{"$f":"[14]Sheet1!$E$6","v":132289.44638000001}]
[]
[]
[]
[]
["Total",null,{"$f":"SUM(C99:C103)","v":103070.55},104876.83,104876.83,92903.82,103987.32,117381.94,132289.44638000001]
[]
[]
["Notes:"]
[1,"List and specify any other interest revenue."]
[2,"In the transition year to IFRS, the applicant is to present information in both MIFRS and CGAAP.  For the typical applicant that adopted IFRS on January 1, 2015, 2014 must be presented in both a CGAAP and MIFRS basis."]
[]
[]
[]
[null,null,{"$f":"G114-3 & \" Actual\" & CHAR(178)","v":"2013 Actual²"},"2014 Actuals",null,{"$f":"F114 & \" Actual\" & CHAR(178)","v":"2015 Actual²"},{"$f":"\"Actual Year\"","v":"Actual Year"},{"$f":"\"Bridge Year\"","v":"Bridge Year"},"Test Year"]
[null,null,2013,"2014 CGAAP","2014 MIFRS",{"$f":"G114-1","v":2015},{"$f":"H114-1","v":2016},{"$f":"BridgeYear","v":2017},{"$f":"TestYear","v":2018}]
["Reporting Basis"]
["SALE OF STOCK",null,3138,6987,6987,11477,4863,8676,9778]
[]
[]
[]
[]
["Total",null,{"$f":"SUM(C116:C120)","v":3138},6987,6987,11477,4863,8676,9778]
[]
[]
["Notes:"]
[1,"List and specify any other interest revenue."]
[2,"In the transition year to IFRS, the applicant is to present information in both MIFRS and CGAAP.  For the typical applicant that adopted IFRS on January 1, 2015, 2014 must be presented in both a CGAAP and MIFRS basis."]
[]
[]
[]
[null,null,{"$f":"G131-3 & \" Actual\" & CHAR(178)","v":"2013 Actual²"},"2014 Actuals",null,{"$f":"F131 & \" Actual\" & CHAR(178)","v":"2015 Actual²"},{"$f":"\"Actual Year\"","v":"Actual Year"},{"$f":"\"Bridge Year\"","v":"Bridge Year"},"Test Year"]
[null,null,2013,"2014 CGAAP","2014 MIFRS",{"$f":"G131-1","v":2015},{"$f":"H131-1","v":2016},{"$f":"BridgeYear","v":2017},{"$f":"TestYear","v":2018}]
["Reporting Basis"]
["GAIN ON DISPOSAL",null,6821,0,0,20219,65702,{"$f":"[14]Sheet1!$D$11","v":8788.7000000000007},{"$f":"[14]Sheet1!$E$11","v":9904.8649000000005}]
[]
[]
[]
[]
["Total",null,{"$f":"SUM(C133:C137)","v":6821},0,0,20219,65702,8788.7000000000007,9904.8649000000005]
[]
[]
["Notes:"]
[1,"List and specify any other interest revenue."]
[2,"In the transition year to IFRS, the applicant is to present information in both MIFRS and CGAAP.  For the typical applicant that adopted IFRS on January 1, 2015, 2014 must be presented in both a CGAAP and MIFRS basis."]
[]
[]
[]
[]
[]
[]
[]
[null,null,{"$f":"G152-3 & \" Actual\" & CHAR(178)","v":"2013 Actual²"},"2014 Actuals",null,{"$f":"F152 & \" Actual\" & CHAR(178)","v":"2015 Actual²"},{"$f":"\"Actual Year\"","v":"Actual Year"},{"$f":"\"Bridge Year\"","v":"Bridge Year"},"Test Year"]
[null,null,2013,"2014 CGAAP","2014 MIFRS",{"$f":"G152-1","v":2015},{"$f":"H152-1","v":2016},{"$f":"BridgeYear","v":2017},{"$f":"TestYear","v":2018}]
["Reporting Basis"]
["NON UTILITY INCOME & EXPENSE",null,22904.48,22329.22,22329.22,22193.59,16139,14566.68,16416.650000000001]
[]
[]
[]
[]
["Total",null,{"$f":"SUM(C154:C158)","v":22904.48},22329.22,22329.22,22193.59,16139,14566.68,16416.650000000001]
[]
[]
["Notes:"]
[1,"List and specify any other interest revenue."]
[2,"In the transition year to IFRS, the applicant is to present information in both MIFRS and CGAAP.  For the typical applicant that adopted IFRS on January 1, 2015, 2014 must be presented in both a CGAAP and MIFRS basis."]

{"sheet":"App_2-I LF_CDM","index":21,"n_rows":112,"n_cols":14,"rows_kept":112,"cut":false,"hidden":false,"merged":[[111,0,111,7],[50,0,50,5],[52,0,52,4],[55,0,55,1],[63,0,63,1],[67,0,67,7],[19,0,19,7],[21,0,21,7],[22,0,22,7],[17,0,17,5],[8,0,8,7],[9,0,9,7],[11,0,11,7],[13,0,13,7],[15,0,15,7],[24,0,24,7],[32,0,32,7],[98,0,98,7],[65,0,65,7],[88,0,88,7],[90,0,90,7],[92,0,92,7],[94,0,94,7],[96,0,96,7],[40,6,40,7],[42,0,42,7],[44,0,44,7],[46,0,46,7],[48,0,48,7],[83,0,83,5]]}
[null,null,null,null,null,null,"File Number:",{"$f":"EBNUMBER","v":"EB-2017-0038"}]
[null,null,null,null,null,null,"Exhibit:"]
[null,null,null,null,null,null,"Tab:"]
[null,null,null,null,null,null,"Schedule:"]
[null,null,null,null,null,null,"Page:"]
[]
[null,null,null,null,null,null,"Date:","Sept 12, 2017"]
[]
["Appendix 2-I"]
["Load Forecast CDM Adjustment Work Form (2018)"]
[]
["Appendix 2-I was initially developed to help determine what would be the amount of CDM savings needed in each year to cumulatively achieve the four year 2011-2014 CDM target.  This then determined the amount of kWh (and with translation, kW of demand) savings that were converted into dollar balances for the LRAMVA, and also to determine the related adjustment to the load forecast to account for OPA-reported savings.  Beginning in the 2015 year, it has been adjusted because the persistence of 2011-2014 CDM programs will be an adjustment to the load forecast in addition to the estimated savings for the first year (2015) for the new 2015-2020 CDM plan."]
[]
["2018 is the fourth year of the six-year (2015-2020) Conservation First program. Final results for the 2011-14 program were issued in the fall of 2015, and the program is completed, although in some instances disposition of the amounts has been deferred. For the purposes of the 2015-2020 LRAMVA, and the impact of CDM on the load forecast, CDM programs in 2014 and earlier are implicit in the historical data on which the base load forecast is developed. Only actual and forecasted impacts of 2015 to 2018 CDM programs need to be reflected in the manual load forecast adjustment and for the LRAMVA threshold amount in 2018 and carrying forward, although the full year impact of 2015 CDM programs and half-year impact of 2016 CDM programs on 2016 historical data is also assumed to be reflected in the base load forecast. "]
[]
["The new six year (2015-2020) CDM program works in a slightly different manner to the previous 2011-2014 CDM program. Distributors will offer programs each year that, over the six years (from January 1, 2015 to December 31, 2020) will strive to achieve savings equal to the new six year CDM target with the full target in place (i.e., persisting) on December 31, 2020. In other words, distributors will be able to offer and execute programs on a basis so that, as long as savings equal to the full target are in place at the end the period, the distributor's 2015-2020 CDM target will have been met."]
[]
["2015-2020 CDM Program - 2018 fourth year of the current CDM plan"]
[]
["For the first year of the new 2015-2020 CDM plan, it is assumed that each year's program will achieve an equal amount of new CDM savings.  This results in each year's program being about 1/6 (16.67%) of the cumulative 2015-2020 CDM target for kWh savings.  A distributor may propose an alternative approach but would be expected to document in its application why it believes that its proposal is more reasonable.  In its proposal, the distributor should ensure that the sum of the results for each year's CDM program from 2015 to 2020 add up to its 2015-2020 CDM target as established by the IESO."]
[]
["6 Year (2015-2020) kWh Target:"]
[27630000]
[null,2015,2016,2017,2018,2019,2020,"Total"]
["%"]
["2015 CDM Programs",null,null,null,null,null,{"$f":"G34/G40","v":0.18748378574013752},{"$f":"H34/H40","v":0.18748378574013752}]
["2016 CDM Programs",null,null,null,null,null,{"$f":"G35/G40","v":0.16250324285197251},{"$f":"H35/H40","v":0.16250324285197251}]
["2017 CDM Programs",null,null,null,null,null,{"$f":"G36/$H$40","v":0.16250324285197248},{"$f":"H36/H40","v":0.16250324285197248}]
["2018 CDM Programs",null,null,null,null,null,{"$f":"G37/$H$40","v":0.16250324285197248},{"$f":"H37/H40","v":0.16250324285197248}]
["2019 CDM Programs",null,null,null,null,null,{"$f":"G38/$H$40","v":0.16250324285197248},{"$f":"H38/H40","v":0.16250324285197248}]
["2020 CDM Programs",null,null,null,null,null,{"$f":"G39/$H$40","v":0.16250324285197254},{"$f":"H39/H40","v":0.16250324285197254}]
["Total in Year",{"$f":"SUM(B26:B31)","v":0},{"$f":"SUM(C26:C31)","v":0},{"$f":"SUM(D26:D31)","v":0},{"$f":"SUM(E26:E29)","v":0},{"$f":"SUM(F26:F30)","v":0},{"$f":"SUM(G26:G31)","v":1},{"$f":"SUM(H26:H31)","v":1}]
["kWh"]
[{"$f":"A26","v":"2015 CDM Programs"},5180177,{"$f":"B34","v":5180177},{"$f":"C34","v":5180177},{"$f":"D34","v":5180177},{"$f":"E34","v":5180177},{"$f":"F34","v":5180177},{"$f":"G34","v":5180177}]
["2016 CDM Programs",null,{"$f":"D35","v":4489964.6000000006},{"$f":"E35","v":4489964.6000000006},{"$f":"F35","v":4489964.6000000006},{"$f":"G35","v":4489964.6000000006},{"$f":"1/5*(A23-H34)","v":4489964.6000000006},4489964.6000000006,null,null,2011,2012,2013,2014]
["2017 CDM Programs",null,null,{"$f":"E36","v":4489964.5999999996},{"$f":"F36","v":4489964.5999999996},{"$f":"G36","v":4489964.5999999996},{"$f":"(1/4)*(A23-(H34+H35))","v":4489964.5999999996},4489964.5999999996,null,"2011 CDM Programs",{"$f":"50%","v":0.5},1,1,1]
["2018 CDM Programs",null,null,null,{"$f":"F37","v":4489964.5999999996},{"$f":"G37","v":4489964.5999999996},{"$f":"(1/3)*(A23-SUM(H34:H36))","v":4489964.5999999996},4489964.5999999996,null,"2012 CDM Programs",null,0.5,1,1]
["2019 CDM Programs",null,null,null,null,{"$f":"G38","v":4489964.5999999996},{"$f":"(1/2)*(A23-SUM(H34:H37))","v":4489964.5999999996},4489964.5999999996,null,"2013 CDM Programs",null,null,0.5,1]
["2020 CDM Programs",null,null,null,null,null,{"$f":"A23-SUM(H34:H38)","v":4489964.6000000015},4489964.6000000015,null,"2014 CDM Programs",null,null,null,0.5]
["Total in Year",{"$f":"SUM(B34:B39)","v":5180177},{"$f":"SUM(C34:C39)","v":9670141.6000000015},{"$f":"SUM(D34:D39)","v":14160106.200000001},{"$f":"SUM(E34:E37)","v":18650070.800000001},{"$f":"SUM(F34:F38)","v":23140035.399999999},{"$f":"SUM(G34:G39)","v":27630000},{"$f":"A23","v":27630000}]
[null,null,null,null,null,null,{"$f":"IF(G40-H40<>0,\"Inputs do no match 2015-20 CDM target\",\"\")","v":""}]
[]
["Note: The default formulae in the above table assume that the 2015-2020 kWh CDM target is achieved through persistence of CDM savings to the end of 2020. The distributor should enter measured CDM savings for 2015, and persistence of 2015 programs for 2016-2020 in row 34. When available, (preliminary/final) CDM savings for 2016 can be entered into row 35. The distributor can also input estimates or forecasts of the 2017 CDM programs if it believes that these are more realistic and can be supported; such information would typically be derived from the CDM plans that the distributor has filed with the IESO. Similarly, CDM savings and persistence into future years can be estimated for 2018, 2019 and 2020 CDM programs. However, the distributor will have to support its proposals for estimated or forecasted savings, particularly beyond the 2017 bridge year. The sum of persistent savings to the end of 2020, should equal the target entered into cell A23."]
[]
["Determination of 2018 Load Forecast Adjustment"]
[]
["The Board determined that the \"net\" number should be used in its Decision and Order with respect to Centre Wellington Hydro Ltd.'s 2013 Cost of Service rates (EB-2012-0113).  This approach has also been used in Settlement Agreements accepted by the Board in other 2013 and 2014 applications.  The distributor should select whether the adjustment is done on a \"net\" or \"gross\" basis, but must support a proposal for the adjustment being done on a \"gross\" basis.  Sheet 2-I defaults to the adjustment being done on a \"net\" basis consistent with Board policy and practice."]
[]
["From each of the 2006-2010 CDM Final Report,  and the 2011 to 2016 CDM Final Reports, issued by the OPA/IESO for the distributor, the distributor should input the \"gross\" and \"net\" results of the cumulative CDM savings for 2018 into cells C57 to C63 and D57 to D63.  The model will calculate the cumulative savings for all programs from 2006 to 2016 and determine the \"net\" to \"gross\" factor \"g\"."]
[]
["Net-to-Gross Conversion"]
[]
["Is CDM adjustment being done on a \"net\" or \"gross\" basis?",null,null,null,null,"net"]
[]
[null,null,"\"Gross\"","\"Net\"","Difference","\"Net-to-Gross\" Conversion Factor"]
["Persistence of Historical CDM programs to 2015",null,"kWh","kWh","kWh","('g')"]
["2006-2010 CDM programs",null,null,null,{"$f":"IF(ISBLANK(D57),\"\",C57-D57)","v":""}]
["2011 CDM program",null,null,null,{"$f":"IF(ISBLANK(D58),\"\",C58-D58)","v":""}]
["2012 CDM program",null,null,null,""]
["2013 CDM program",null,null,null,""]
["2014 CDM program",null,null,null,""]
["2015 CDM program"]
["2016 CDM program",null,null,null,""]
["2006 to 2016 OPA CDM programs:  Persistence to 2018.",null,{"$f":"SUM(C57:C63)","v":0},{"$f":"SUM(D57:D63)","v":0},{"$f":"C64-D64","v":0},{"$f":"IF(D64=0,0,IF(F53=\"net\",0,E64/D64))","v":0}]
[]
["The default values below represent the factor used for how each year's CDM program is factored into the manual CDM adjustment.  Distributors can choose alternative weights of \"0\", \"0.5\" or \"1\" from the drop-down menu for each cell, but must support its alternatives."]
[]
["These factors do not mean that CDM programs are excluded, but the assumption that impacts of previous year CDM programs are already implicitly reflected in the actual data for historical years that are used to derive the load forecast prior to any manual CDM adjustment for the 2018 test year."]
[]
[]
[]
[]
[]
[]
[]
[]
[]
[]
[]
[]
[]
[]
[]
["Weight Factor for Inclusion in CDM Adjustment to 2018 Load Forecast"]
[null,2015,2016,2017,2018,2019,2020]
["Weight Factor for each year's CDM program impact on 2018 load forecast",0,0.5,1,0.5,0,0,"Distributor can select \"0\", \"0.5\", or \"1\" from drop-down list"]
["Default Value selection rationale.  ","Full year impact of 2015 CDM is assumed to be reflected in the base forecast, as the full year persistence of 2015 CDM programs is in the 2016 historical actual data. No further impact is necessary for the manual adjustment to the load forecast.","Default is 0.5, but one option is for full year impact of persistence of 2016 CDM programs on 2018 load forecast, but 50% impact in base forecast (first year impact of 2016 CDM programs on 2016 actuals, which is part of the data underlying the base load forecast).","Full year impact of persistence of 2017 programs on 2018 load forecast.  2017 CDM program impacts are not in the base forecast.","Only 50% of 2017 CDM programs are assumed to impact the 2018 load forecast based on the \"half-year\" rule.","2019 and 2020 are future years beyond the 2018 test year. No impacts of CDM programs beyond the 2018 test year are factored into the test year load forecast."]
[]
["2015-2020 LRAMVA and 2018 CDM adjustment to Load Forecast"]
[]
["One manual adjustment for CDM impacts to the 2018 load forecast is made.  There is a different but related threshold amount that is used for the 2018 LRAMVA amount for Account 1568."]
[]
["The amount used for the CDM threshold of the LRAMVA is the kWh that will be used to determine the base amount for the LRAMVA balance for 2018, for assessing performance against the six-year target."]
[]
["If used to determine the manual CDM adjustment for the system purchased kWh, the proposed loss factor should correspond with the proposed total loss factor calculated in Appendix 2-R ."]
[]
["The Manual Adjustment for the 2018 Load Forecast is the amount manually subtracted from the system-wide load forecast (either based on a purchased or billed basis) derived from the base forecast from historical data. If the distributor has developed their load forecast on a system purchased basis, then the manual adjustment should be on a system purchased basis, including the adjustment for losses.  If the load forecast has been developed on a billed basis, either on a system basis or on a class-specific basis, the manual adjustment should be on a billed basis, excluding losses."]
[]
["The distributor should determine the allocation of the savings to all customer classes in a reasonable manner (e.g. taking into account what programs and what IESO-measured impacts were directed at specific customer classes), for both the LRAMVA and for the load forecast adjustment."]
[]
[null,2015,2016,2017,2018,2019,2020,"Total for 2018"]
[]
["Amount used for CDM threshold for LRAMVA (2018)",{"$f":"E34","v":5180177},{"$f":"E35","v":4489964.6000000006},{"$f":"E36","v":4489964.5999999996},{"$f":"E37","v":4489964.5999999996},null,null,{"$f":"SUM(B103:G103)","v":18650070.800000001}]
[]
["Manual Adjustment for 2018 Load Forecast (billed basis)",{"$f":"B103*(1+F64)*B86","v":0},{"$f":"C103*(1+F64)*C86","v":2244982.3000000003},{"$f":"D103*(1+F64)*D86","v":4489964.5999999996},{"$f":"E103*(1+G64)*E86","v":2244982.2999999998},null,null,{"$f":"SUM(B105:G105)","v":8979929.1999999993}]
["Manual Adjustment for 2018 LDC-only CDM programs (billed basis)"]
["Total Manual Forecast to Load Forecast",{"$f":"B105+B106","v":0},{"$f":"C105+C106","v":2244982.3000000003},{"$f":"D105+D106","v":4489964.5999999996},{"$f":"E105+E106","v":2244982.2999999998},null,null,{"$f":"SUM(B107:G107)","v":8979929.1999999993}]
[]
["Proposed Loss Factor (TLF)",3.2500000000000001E-2," Format: X.XX%"]
["Manual Adjustment for 2018 Load Forecast (system purchased basis)",{"$f":"B107*(1+$B109)","v":0},{"$f":"C107*(1+$B109)","v":2317944.2247500001},{"$f":"D107*(1+$B109)","v":4635888.4494999992},{"$f":"E107*(1+$B109)","v":2317944.2247499996},null,null,{"$f":"SUM(B110:G110)","v":9271776.8989999983}]
[]
["Manual adjustment uses \"gross\" versus \"net\" (i.e. numbers multiplied by (1 + g).  The Weight factor is also used to calculate the impact of each year's program on the CDM adjustment to the 2018 load forecast."]

{"sheet":"App.2-IA_Load_Forecast_Instrct","index":22,"n_rows":45,"n_cols":18,"rows_kept":45,"cut":false,"hidden":false,"merged":[[9,1,9,17],[8,1,8,17],[18,1,18,17],[20,1,20,17],[22,1,22,17],[24,1,24,17],[26,1,26,17],[43,2,43,17],[44,2,44,17],[28,8,28,10],[28,12,28,14],[29,13,29,14],[29,9,29,10],[41,2,41,17],[42,2,42,17],[28,16,28,17]]}
[null,null,null,null,null,null,null,null,null,null,null,null,null,null,null,null,"File Number:",{"$f":"EBNUMBER","v":"EB-2017-0038"}]
[null,null,null,null,null,null,null,null,null,null,null,null,null,null,null,null,"Exhibit:"]
[null,null,null,null,null,null,null,null,null,null,null,null,null,null,null,null,"Tab:"]
[null,null,null,null,null,null,null,null,null,null,null,null,null,null,null,null,"Schedule:"]
[null,null,null,null,null,null,null,null,null,null,null,null,null,null,null,null,"Page:"]
[]
[null,null,null,null,null,null,null,null,null,null,null,null,null,null,null,null,"Date:"]
[]
[null,"Appendix 2-IA"]
[null,"Instructions on Customer, Connections, Load Forecast and Revenues Data and Analysis"]
[]
[null,"This sheet requires no inputs, but serves as a summary of the hiostorical and forecasted data to be provided with respect to:"]
[]
[null,"1)","Customers and connections"]
[null,"2)","Consumption (kWh)"]
[null,"3)","Demand (kW or kCA) for applicable demand-billed customer classes"]
[null,"4)","Revenues"]
[]
[null,"The spreadsheet summarizes the data provided and the analyses (variance or year-over-year) that are required. Data are required to be provided on a customer class level. Consumption (kWh) must also be provided on a total distribution system level."]
[]
[null,"Appendix 2-IB (formerly 2-IA) is the appendix spreadsheet that the distributor populates, and the spreadsheet is laid out for inputting the necessary data. The spreadsheet also calculates necessary statistics such as average consumption per customer/connection per year, and variances and % annual changes, as necessary."]
[]
[null,"The distributor is required to provide suitable documentation in Exhibit 3 of its Application, in accordance with section 2.3.2 of Chaoter 2 of the Filing Requirements. This would include explanations for material variations or of trends in the data."]
[]
[null,"The distributor is also required to input its test year customer/connection and load forecast in Sheet 10 - Load Forecast of the Revenue Requirement Work Form. This sheet should also be updated to reflect changes in the load forecast made through the stages of processing of the rates application."]
[]
[null,"The applicant must demonstrate the historical accuracy of its load forecast approach for at least the past 5 years. Such analysis will cover both customer/connections and consumption (kWh) and demand (kW or kVA) by providing the following, as shown in the following table:"]
[]
[null,null,null,"Calendar Year",null,"Customers / Connections",null,null,"Consumption (kWh) (3)",null,null,null,"Demand (kW or kVA)",null,null,null,"Revenues"]
[null,null,null,{"$f":"\"(for \"&TestYear&\" Cost of Service)\"","v":"(for 2018 Cost of Service)"},null,null,null,null,"Weather-actual","Weather-normalized",null,null,"Weather-actual","Weather-normalized",null,null,"Weather-actual","Weather-normalized"]
[null,null,"Historical",{"$f":"D32-1","v":2012},null,"Actual",null,null,"Actual","Actual (1)",null,null,"Actual","Actual (1)",null,null,"Actual"]
[null,null,"Historical",2013,null,"Actual",null,null,"Actual","Actual (1)",null,null,"Actual","Actual (1)",null,null,"Actual"]
[null,null,"Historical",2014,null,"Actual","Board-approved (2)",null,"Actual","Actual (1)","Board-approved (2)",null,"Actual","Actual (1)","Board-approved (2)",null,"Actual"]
[null,null,"Historical",2015,null,"Actual",null,null,"Actual","Actual (1)",null,null,"Actual","Actual (1)",null,null,"Actual"]
[null,null,"Historical",2016,null,"Actual",null,null,"Actual","Actual (1)",null,null,"Actual","Actual (1)",null,null,"Actual"]
[null,null,"Bridge Year (Forecast)",2017,null,"Forecast",null,null,null,"Forecast",null,null,null,"Forecast",null,null,null,"Forecast"]
[null,null,"Test Year (Forecast)",{"$f":"TestYear","v":2018},null,"Forecast",null,null,null,"Forecast",null,null,null,"Forecast",null,null,null,"Forecast"]
[]
[]
[null,"Notes:"]
[]
[null,"(1)","“Weather-normalized actuals” are estimated by replacing the actual weather-related values (typically Heating Degree Days (HDD) and Cooling Degree Days (CDD)) by the “typical” or “weather-normalized” values. These “weather-normalized HDD and CDD values would be the same as used to estimate the Bridge Year and Test Year forecasts."]
[null,"(2)","For 2017 Cost of Service rebasers, the typical situation is that 2013 would have been the most recent cost of service rebasing application. If the most recent rebasing application was for a rate year other than 2013, that year should be used. An applicant must provide historical information back to the greater of: a) at least five (5) historical actual years; or b) to its last cost of service application."]
[null,"(3)","Consumption must be provided on a total distribution system basis as well as at a customer class level."]
[null,"(4)","Revenues exclude commodity charges."]

{"sheet":"App.2-IB_Load_Forecast_Analysis","index":23,"n_rows":668,"n_cols":21,"rows_kept":668,"cut":false,"hidden":false,"merged":[[251,16,251,20],[251,10,251,14],[251,5,251,8],[249,3,249,5],[283,17,283,19],[273,5,273,7],[282,11,282,12],[282,17,282,18],[252,5,252,7],[261,11,261,12],[261,17,261,18],[272,5,272,8],[272,10,272,14],[272,16,272,20],[210,5,210,8],[210,10,210,14],[210,16,210,20],[211,5,211,7],[220,11,220,12],[220,17,220,18],[159,11,159,12],[159,17,159,18],[187,3,187,5],[189,5,189,8],[189,10,189,14],[189,16,189,20],[190,5,190,7],[199,11,199,12],[199,17,199,18],[100,11,100,12],[90,5,90,8],[91,5,91,7],[79,17,79,18],[90,16,90,20],[100,17,100,18],[150,5,150,7],[46,11,46,12],[126,3,126,5],[128,5,128,8],[128,10,128,14],[138,11,138,12],[138,17,138,18],[149,5,149,8],[149,10,149,14],[149,16,149,20],[312,3,312,5],[314,5,314,8],[314,10,314,14],[314,16,314,20],[315,5,315,7],[24,1,24,21],[8,1,8,21],[9,1,9,21],[18,1,18,21],[20,1,20,21],[22,1,22,21],[26,1,26,21],[69,10,69,14],[69,16,69,20],[36,10,36,14],[37,5,37,7],[28,1,28,21],[67,3,67,5],[70,5,70,7],[69,5,69,8],[128,16,128,20],[129,5,129,7],[79,11,79,12],[90,10,90,14],[336,5,336,7],[345,11,345,12],[345,17,345,18],[373,3,373,5],[375,5,375,8],[375,10,375,14],[375,16,375,20],[324,11,324,12],[324,17,324,18],[335,5,335,8],[335,10,335,14],[335,16,335,20],[397,5,397,7],[406,11,406,12],[406,17,406,18],[433,3,433,5],[435,5,435,8],[435,10,435,14],[435,16,435,20],[376,5,376,7],[385,11,385,12],[385,17,385,18],[396,5,396,8],[396,10,396,14],[396,16,396,20],[457,5,457,7],[466,11,466,12],[466,17,466,18],[497,3,497,5],[499,5,499,8],[499,10,499,14],[499,16,499,20],[436,5,436,7],[445,11,445,12],[445,17,445,18],[456,5,456,8],[456,10,456,14],[456,16,456,20],[521,5,521,7],[530,11,530,12],[530,17,530,18],[561,3,561,5],[563,5,563,8],[563,10,563,14],[563,16,563,20],[500,5,500,7],[509,11,509,12],[509,17,509,18],[520,5,520,8],[520,10,520,14],[520,16,520,20],[585,5,585,7],[594,11,594,12],[594,17,594,18],[624,3,624,5],[626,5,626,8],[626,10,626,14],[626,16,626,20],[564,5,564,7],[573,11,573,12],[573,17,573,18],[584,5,584,8],[584,10,584,14],[584,16,584,20],[648,5,648,7],[657,11,657,12],[657,17,657,18],[627,5,627,7],[636,11,636,12],[636,17,636,18],[647,5,647,8],[647,10,647,14],[647,16,647,20]]}
[null,null,null,null,null,null,null,null,null,null,null,null,null,null,null,null,null,null,null,"File Number:",{"$f":"EBNUMBER","v":"EB-2017-0038"}]
[null,null,null,null,null,null,null,null,null,null,null,null,null,null,null,null,null,null,null,"Exhibit:",3]
[null,null,null,null,null,null,null,null,null,null,null,null,null,null,null,null,null,null,null,"Tab:",1]
[null,null,null,null,null,null,null,null,null,null,null,null,null,null,null,null,null,null,null,"Schedule:"]
[null,null,null,null,null,null,null,null,null,null,null,null,null,null,null,null,null,null,null,"Page:"]
[]
[null,null,null,null,null,null,null,null,null,null,null,null,null,null,null,null,null,null,null,"Date:","Sept 12, 2017"]
[]
[null,"Appendix 2-IB"]
[null,"Customer, Connections, Load Forecast and Revenues Data and Analysis"]
[]
[null,"This sheet requires no inputs, but serves as a summary of the hiostorical and forecasted data to be provided with respect to:"]
[]
[null,"1)","Customers and connections"]
[null,"2)","Consumption (kWh)"]
[null,"3)","Demand (kW or kCA) for applicable demand-billed customer classes"]
[null,"4)","Revenues"]
[]
[null,"The spreadsheet summarizes the data provided and the analyses (variance or year-over-year) that are required. Data are required to be provided on a customer class level. Consumption (kWh) must also be provided on a total distribution system level."]
[]
[null,"Appendix 2-IB (formerly 2-IA) is the appendix spreadsheet that the distributor populates, and the spreadsheet is laid out for inputting the necessary data. The spreadsheet also calculates necessary statistics such as average consumption per customer/connection per year, and variances and % annual changes, as necessary."]
[]
[null,"The distributor is required to provide suitable documentation in Exhibit 3 of its Application, in accordance with section 2.3.2 of Chaoter 2 of the Filing Requirements. This would include explanations for material variations or of trends in the data."]
[]
[null,"The distributor is also required to input its test year customer/connection and load forecast in Sheet 10 - Load Forecast of the Revenue Requirement Work Form. This sheet should also be updated to reflect changes in the load forecast made through the stages of processing of the rates application."]
[]
[null,"The applicant must demonstrate the historical accuracy of its load forecast approach for at least the past 5 years. Such analysis will cover both customer/connections and consumption (kWh) and demand (kW or kVA) by providing the following, as shown in the following table:"]
[]
[null,"This sheet is to be filled in accordance with the instructions documented in section 2.3.2 of Chapter 2 of the Filing Requirements for Distribution Rate Applications, in terms of one set of tables per customer class."]
[]
[null,"Color coding for Cells:",null,null,null,"Data input",null,null,null,null,"Drop-down List"]
[]
[null,null,null,null,null,"No data entry required",null,null,null,null,"Blank or calculated value"]
[]
[null,"Distribution System (Total)"]
[]
[null,null,null,"Calendar Year",null,null,null,null,null,null,"Consumption (kWh) (3)"]
[null,null,null,{"$f":"CONCATENATE(\"(for \",TestYear,\" Cost of Service\")","v":"(for 2018 Cost of Service"},null,null,null,null,null,null,null,"Actual (Weather actual)","Weather-normalized",null,"Weather-normalized"]
[null,null,"Historical",{"$f":"D40-1","v":2012},null,null,null,null,null,null,"Actual",489248042.2899999,491617722.53201014,""]
[null,null,"Historical",2013,null,null,null,null,null,null,"Actual",486905989.12,485495942.27632338,"Board-approved",462657415]
[null,null,"Historical",2014,null,null,null,null,null,null,"Actual",492137455.65999997,491039470.87431294,""]
[null,null,"Historical",2015,null,null,null,null,null,null,"Actual",481737801.15999997,481669411.81126261,""]
[null,null,"Historical",2016,null,null,null,null,null,null,"Actual",481118177.45000005,478889501.41794336,""]
[null,null,"Bridge Year",2017,null,null,null,null,null,null,"Forecast",null,482700590.86019009,""]
[null,null,"Test Year",{"$f":"TestYear","v":2018},null,null,null,null,null,null,"Forecast",null,482019667.86262476,""]
[null,null,null,null,null,null,null,null,null,null,null,null,null,null,{"$f":"SUM(O39:O44)","v":462657415}]
[null,null,"Variance Analysis",null,null,null,null,null,null,null,"Year","Year-over-year",null,null,"Versus Board-approved"]
[null,null,null,{"$f":"D39","v":2012},null,null,null,null,null,null,{"$f":"D48","v":2012}]
[null,null,null,2013,null,null,null,null,null,null,{"$f":"D49","v":2013},-4.7870465848725008E-3,-1.2452318081938474E-2]
[null,null,null,2014,null,null,null,null,null,null,2014,1.0744305177792013E-2,1.141827997984457E-2]
[null,null,null,2015,null,null,null,null,null,null,2015,-2.1131605368368334E-2,-1.9082089361098786E-2]
[null,null,null,2016,null,null,null,null,null,null,2016,-1.2862260518230473E-3,-5.7714073701830015E-3]
[null,null,null,2017,null,null,null,null,null,null,2017,"",7.9581812317088829E-3]
[null,null,null,2018,null,null,null,null,null,null,2018,"",-1.4106529191354467E-3,null,4.1850086554053645E-2]
[null,null,null,"Geometric Mean",null,null,null,null,null,null,"Geometric Mean",-5.5699876824180095E-3,-3.9355373633576107E-3,null,1.030222172921369E-2]
[]
[]
[]
[]
[]
[]
[]
[]
[]
[]
[null,"Customer Class Analysis (one for each Customer Class, excluding MicroFIT and Standby)"]
[]
[null,1,"Customer Class:","Residential",null,null,null,"Is the customer class billed on consumption (kWh) or demand (kW or kVA)?",null,null,null,null,null,"kWh"]
[]
[null,null,null,"Calendar Year",null,"Customers",null,null,null,null,"Consumption (kWh) (3)",null,null,null,null,null,{"$f":"CONCATENATE(\"Consumption (kWh) per \",LEFT(F70,LEN(F70)-1))","v":"Consumption (kWh) per Customer"}]
[null,null,null,{"$f":"CONCATENATE(\"(for \",TestYear,\" Cost of Service\")","v":"(for 2018 Cost of Service"},null,null,null,null,null,null,null,"Actual (Weather actual)","Weather-normalized",null,"Weather-normalized",null,null,{"$f":"L71","v":"Actual (Weather actual)"},{"$f":"M71","v":"Weather-normalized"},null,{"$f":"O71","v":"Weather-normalized"}]
[null,null,"Historical",{"$f":"D73-1","v":2012},null,{"$f":"K39","v":"Actual"},16236.25,"",null,null,{"$f":"F72","v":"Actual"},136951769.39000002,139389581.88357025,"",null,null,{"$f":"K72","v":"Actual"},8434.9384488413289,8585.0847260648388,"",""]
[null,null,"Historical",2013,null,"Actual",16383,"Board-approved",16461,null,{"$f":"F73","v":"Actual"},139174379.21000001,138410480.82613337,"Board-approved",147767075,null,{"$f":"K73","v":"Actual"},8495.0484776902886,8448.4209745549269,"Board-approved",8976.7981896604088]
[null,null,"Historical",2014,null,"Actual",16515.916666666668,"",null,null,"Actual",137614288.20000002,137312111.0658522,"",null,null,"Actual",8332.2222421805236,8313.9261257586186,"",""]
[null,null,"Historical",2015,null,"Actual",16667.416666666668,"",null,null,"Actual",135712848.27999997,135937016.40737656,"",null,null,"Actual",8142.4044885980111,8155.8539710138975,"",""]
[null,null,"Historical",2016,null,"Actual",16855.083333333332,"",null,null,"Actual",136671067.22,134543557.55034554,"",null,null,"Actual",8108.5963514468931,7982.3727293158181,"",""]
[null,null,"Bridge Year",2017,null,"Forecast",16986.648595616094,"",null,null,"Forecast",null,133927949.32313533,"",null,null,"Forecast",0,7884.3068171610612,"",""]
[null,null,"Test Year",{"$f":"TestYear","v":2018},null,"Forecast",17119.240813262837,"",null,null,"Forecast",null,133764095.01592508,"",null,null,"Forecast",{"$f":"IF(G78=0,\"\",L78/G78)","v":0},{"$f":"IF(G78=0,\"\",M78/G78)","v":7813.6698043463266},{"$f":"N78","v":""},{"$f":"IF(T78=\"\",\"\",IF(I78=0,\"\",O78/I78))","v":""}]
[null,null,null,null,null,null,null,null,{"$f":"SUM(I72:I77)","v":16461},null,null,null,null,null,{"$f":"SUM(O72:O77)","v":147767075},null,null,null,null,null,{"$f":"SUM(U72:U77)","v":8976.7981896604088}]
[null,null,"Variance Analysis","Year",null,null,"Year-over-year",null,"Test Year Versus Board-approved",null,"Year","Year-over-year",null,null,{"$f":"I80","v":"Test Year Versus Board-approved"},null,"Year","Year-over-year",null,null,{"$f":"O80","v":"Test Year Versus Board-approved"}]
[null,null,null,{"$f":"D72","v":2012},null,null,null,null,null,null,{"$f":"D81","v":2012},null,null,null,null,null,{"$f":"K81","v":2012}]
[null,null,null,2013,null,null,9.0384171221802312E-3,null,null,null,{"$f":"D82","v":2013},1.6229142784352169E-2,-7.0242054263044418E-3,null,null,null,{"$f":"K82","v":2013},7.1263150541680531E-3,-1.5918742315377821E-2]
[null,null,null,2014,null,null,8.1130847016217533E-3,null,null,null,2014,-1.120961357151784E-2,-7.9355967389558302E-3,null,null,null,2014,-1.9167193211125255E-2,-1.5919524985956723E-2]
[null,null,null,2015,null,null,9.172969509210871E-3,null,null,null,2015,-1.3817169313382727E-2,-1.0014372714844955E-2,null,null,null,2015,-2.2781167864389329E-2,-1.9012937131468344E-2]
[null,null,null,2016,null,null,1.1259493322800296E-2,null,null,null,2016,7.0606353941009559E-3,-1.0250768288566081E-2,null,null,null,2016,-4.1521073042318779E-3,-2.1270763590745534E-2]
[null,null,null,2017,null,null,7.8056726081308092E-3,null,null,null,2017,"",-4.5755310653194936E-3,null,null,null,2017,"",-1.2285308576809872E-2]
[null,null,null,2018,null,null,7.8056726081308092E-3,null,3.9987899475295352E-2,null,2018,"",-1.2234511768332013E-3,null,-9.4763870666553562E-2,null,2018,"",-8.9591912710683674E-3,null,-0.12957051732028335]
[null,null,null,"Geometric Mean",null,null,1.0647612224339076E-2,null,9.8504690947833762E-3,null,"Geometric Mean",-6.8368148784281324E-4,-8.2051517857509859E-3,null,-2.4582664573761903E-2,null,"Geometric Mean",-1.306643054108958E-2,-1.8654141940331548E-2,null,-3.4097259665988644E-2]
[]
[]
[null,null,null,"Calendar Year",null,"Revenues",null,null,null,null,{"$f":"IF(ISBLANK(N68),\"\",CONCATENATE(\"Demand (\",N68,\")\"))","v":"Demand (kWh)"},null,null,null,null,null,{"$f":"CONCATENATE(\"Demand (\",N68,\") per \",LEFT(F70,LEN(F70)-1))","v":"Demand (kWh) per Customer"}]
[null,null,null,{"$f":"CONCATENATE(\"(for \",TestYear,\" Cost of Service\")","v":"(for 2018 Cost of Service"},null,null,null,null,null,null,null,"Actual (Weather actual)","Weather-normalized",null,{"$f":"M92","v":"Weather-normalized"},null,null,{"$f":"L92","v":"Actual (Weather actual)"},{"$f":"M92","v":"Weather-normalized"},null,{"$f":"O92","v":"Weather-normalized"}]
[null,null,"Historical",{"$f":"D94-1","v":2012},null,null,"",null,null,null,{"$f":"K72","v":"Actual"},null,null,{"$f":"N72","v":""},null,null,{"$f":"K93","v":"Actual"},{"$f":"IF(G93=0,\"\",L93/G93)","v":{"$error":"#VALUE!"}},{"$f":"IF(G93=0,\"\",M93/G93)","v":{"$error":"#VALUE!"}},{"$f":"N93","v":""},{"$f":"IF(T93=\"\",\"\",IF(I93=0,\"\",O93/I93))","v":""}]
[null,null,"Historical",2013,null,null,"Board-approved",5636524.4801013749,null,null,"Actual",null,null,"Board-approved",null,null,{"$f":"K94","v":"Actual"},{"$f":"IF(G94=0,\"\",L94/G94)","v":{"$error":"#VALUE!"}},{"$f":"IF(G94=0,\"\",M94/G94)","v":{"$error":"#VALUE!"}},{"$f":"N94","v":"Board-approved"},{"$f":"IF(T94=\"\",\"\",IF(I94=0,\"\",O94/I94))","v":""}]
[null,null,"Historical",2014,null,null,"",null,null,null,"Actual",null,null,"",null,null,"Actual",{"$error":"#VALUE!"},{"$error":"#VALUE!"},"",""]
[null,null,"Historical",2015,null,null,"",null,null,null,"Actual",null,null,"",null,null,"Actual",{"$error":"#VALUE!"},{"$error":"#VALUE!"},"",""]
[null,null,"Historical",2016,null,null,"",null,null,null,"Actual",null,null,"",null,null,"Actual",{"$error":"#VALUE!"},{"$error":"#VALUE!"},"",""]
[null,null,"Bridge Year (Forecast)",2017,null,null,"",null,null,null,"Forecast",null,null,"",null,null,"Forecast",{"$error":"#VALUE!"},{"$error":"#VALUE!"},"",""]
[null,null,"Test Year (Forecast)",{"$f":"TestYear","v":2018},null,6986214.3799999999,"",null,null,null,"Forecast",null,null,"",null,null,"Forecast",{"$error":"#VALUE!"},{"$error":"#VALUE!"},"",""]
[null,null,null,null,null,null,null,null,{"$f":"SUM(I93:I98)","v":0},null,null,null,null,null,{"$f":"SUM(O93:O98)","v":0},null,null,null,null,null,{"$f":"SUM(U93:U98)","v":0}]
[null,null,"Variance Analysis","Year",null,null,"Year-over-year",null,{"$f":"I80","v":"Test Year Versus Board-approved"},null,"Year","Year-over-year",null,null,{"$f":"I101","v":"Test Year Versus Board-approved"},null,"Year","Year-over-year",null,null,{"$f":"O101","v":"Test Year Versus Board-approved"}]
[null,null,null,{"$f":"D93","v":2012},null,null,null,null,null,null,{"$f":"D102","v":2012},null,null,null,null,null,{"$f":"K102","v":2012}]
[null,null,null,2013,null,null,"",null,null,null,{"$f":"D103","v":2013},{"$f":"IF(L93=0,\"\",L94/L93-1)","v":""},"",null,null,null,{"$f":"K103","v":2013},{"$f":"IF(R93=\"\",\"\",IF(R93=0,\"\",R94/R93-1))","v":{"$error":"#VALUE!"}},{"$f":"IF(S93=\"\",\"\",IF(S93=0,\"\",S94/S93-1))","v":{"$error":"#VALUE!"}}]
[null,null,null,2014,null,null,"",null,null,null,2014,"","",null,null,null,2014,{"$f":"IF(R94=\"\",\"\",IF(R94=0,\"\",R95/R94-1))","v":{"$error":"#VALUE!"}},{"$error":"#VALUE!"}]
[null,null,null,2015,null,null,"",null,null,null,2015,"","",null,null,null,2015,{"$error":"#VALUE!"},{"$error":"#VALUE!"}]
[null,null,null,2016,null,null,"",null,null,null,2016,"","",null,null,null,2016,{"$error":"#VALUE!"},{"$error":"#VALUE!"}]
[null,null,null,2017,null,null,"",null,null,null,2017,{"$f":"IF(K98=\"Forecast\",\"\",IF(L97=0,\"\",L98/L97-1))","v":""},{"$f":"IF(M97=0,\"\",M98/M97-1)","v":""},null,null,null,2017,{"$f":"IF(Q98=\"Forecast\",\"\",IF(R97=0,\"\",R98/R97-1))","v":""},{"$f":"IF(S97=\"\",\"\",IF(S97=0,\"\",S98/S97-1))","v":{"$error":"#VALUE!"}}]
[null,null,null,2018,null,null,"",null,0.23945427801536856,null,2018,{"$f":"IF(K99=\"Forecast\",\"\",IF(L98=0,\"\",L99/L98-1))","v":""},{"$f":"IF(M98=0,\"\",M99/M98-1)","v":""},null,{"$f":"IF(O100=0,\"\",M99/O100-1)","v":""},null,2018,{"$f":"IF(Q99=\"Forecast\",\"\",IF(R98=0,\"\",R99/R98-1))","v":""},{"$f":"IF(S98=\"\",\"\",IF(S98=0,\"\",S99/S98-1))","v":{"$error":"#VALUE!"}},null,{"$f":"IF(U100=0,\"\",S99/U100-1)","v":""}]
[null,null,null,"Geometric Mean",null,null,"",null,5.5134024280971916E-2,null,"Geometric Mean",{"$f":"IF(L93=0,\"\",(L97/L93)^(1/($D97-$D93-1))-1)","v":""},{"$f":"IF(M93=0,\"\",(M99/M93)^(1/($D99-$D93-1))-1)","v":""},null,{"$f":"IF(O100=0,\"\",(M99/O100)^(1/(TestYear-RebaseYear-1))-1)","v":""},null,"Geometric Mean",{"$f":"IF(R93=\"\",\"\",IF(R93=0,\"\",(R97/R93)^(1/($D97-$D93-1))-1))","v":{"$error":"#VALUE!"}},{"$f":"IF(S93=\"\",\"\",IF(S93=0,\"\",(S99/S93)^(1/($D99-$D93-1))-1))","v":{"$error":"#VALUE!"}},null,{"$f":"IF(U100=0,\"\",(S99/U100)^(1/(TestYear-RebaseYear-1))-1)","v":""}]
[]
[]
[]
[]
[]
[]
[]
[]
[]
[]
[]
[]
[]
[]
[]
[]
[]
[null,2,"Customer Class:","GS < 50 kW",null,null,null,"Is the customer class billed on consumption (kWh) or demand (kW or kVA)?",null,null,null,null,null,"kWh"]
[]
[null,null,null,"Calendar Year",null,"Customers",null,null,null,null,"Consumption (kWh) (3)",null,null,null,null,null,{"$f":"CONCATENATE(\"Consumption (kWh) per \",LEFT(F129,LEN(F129)-1))","v":"Consumption (kWh) per Customer"}]
[null,null,null,{"$f":"CONCATENATE(\"(for \",TestYear,\" Cost of Service\")","v":"(for 2018 Cost of Service"},null,null,null,null,null,null,null,"Actual (Weather actual)","Weather-normalized",null,"Weather-normalized",null,null,{"$f":"L130","v":"Actual (Weather actual)"},{"$f":"M130","v":"Weather-normalized"},null,{"$f":"O130","v":"Weather-normalized"}]
[null,null,"Historical",{"$f":"D132-1","v":2012},null,{"$f":"F72","v":"Actual"},1921,"",null,null,{"$f":"F131","v":"Actual"},47672678.809999987,47885456.068439938,"",null,null,{"$f":"K131","v":"Actual"},24816.594903695986,24927.358702987996,"",""]
[null,null,"Historical",2013,null,"Actual",1940,"Board-approved",1857,null,{"$f":"F132","v":"Actual"},48218851.180000007,47845444.420189984,"Board-approved",50306768,null,{"$f":"K132","v":"Actual"},24855.077927835056,24662.600216592775,"Board-approved",27090.343564889608]
[null,null,"Historical",2014,null,"Actual",1952.9166666666667,"",null,null,"Actual",48123470.799999997,47594029.358460717,"",null,null,"Actual",24641.845513121396,24370.742577406811,"",""]
[null,null,"Historical",2015,null,"Actual",1989.3333333333333,"",null,null,"Actual",50019956.109999992,49973926.393886022,"",null,null,"Actual",25144.079814008041,25120.941551886408,"",""]
[null,null,"Historical",2016,null,"Actual",1993.3333333333333,"",null,null,"Actual",48503240.200000003,48633329.947597809,"",null,null,"Actual",24332.729197324417,24397.991612507263,"",""]
[null,null,"Bridge Year",2017,null,"Forecast",2005.7581747453632,"",null,null,"Forecast",null,48915622.715948865,"",null,null,"Forecast",0,24387.597334438804,"",""]
[null,null,"Test Year",{"$f":"TestYear","v":2018},null,"Forecast",2018.2604626544405,"",null,null,"Forecast",null,49394964.62727017,"",null,null,"Forecast",0,24474.028769460863,"",""]
[null,null,null,null,null,null,null,null,{"$f":"SUM(I131:I136)","v":1857},null,null,null,null,null,{"$f":"SUM(O131:O136)","v":50306768},null,null,null,null,null,{"$f":"SUM(U131:U136)","v":27090.343564889608}]
[null,null,"Variance Analysis","Year",null,null,"Year-over-year",null,"Test Year Versus Board-approved",null,"Year","Year-over-year",null,null,{"$f":"I139","v":"Test Year Versus Board-approved"},null,"Year","Year-over-year",null,null,{"$f":"O139","v":"Test Year Versus Board-approved"}]
[null,null,null,{"$f":"D131","v":2012},null,null,null,null,null,null,{"$f":"D140","v":2012},null,null,null,null,null,{"$f":"K140","v":2012}]
[null,null,null,2013,null,null,9.8906819364914522E-3,null,null,null,{"$f":"D141","v":2013},1.1456716585547699E-2,-8.3556995244582488E-4,null,null,null,{"$f":"K141","v":2013},1.5506971963079597E-3,-1.0621200968375599E-2]
[null,null,null,2014,null,null,6.6580756013745468E-3,null,null,null,2014,-1.9780724273988914E-3,-5.2547335441444076E-3,null,null,null,2014,-8.5790282103627158E-3,-1.1834017363246407E-2]
[null,null,null,2015,null,null,1.8647322381053932E-2,null,null,null,2015,3.9408739196757914E-2,5.0004109076388525E-2,null,null,null,2015,2.0381359043064151E-2,3.0782770450953789E-2]
[null,null,null,2016,null,null,2.0107238605897582E-3,null,null,null,2016,-3.0322215930468688E-2,-2.6825917894100604E-2,null,null,null,2016,-3.2268057637631742E-2,-2.877877558394526E-2]
[null,null,null,2017,null,null,6.2331980327909875E-3,null,null,null,2017,"",5.8045124332475329E-3,null,null,null,2017,"",-4.2603006975094893E-4]
[null,null,null,2018,null,null,6.2331980327909875E-3,null,8.683923675521843E-2,null,2018,"",9.7993623449266209E-3,null,-1.8124864883584446E-2,null,2018,"",3.5440734007858854E-3,null,-9.657739441959734E-2]
[null,null,null,"Geometric Mean",null,null,9.9269685810783326E-3,null,2.1036640314963551E-2,null,"Geometric Mean",5.7739860478744909E-3,6.2266376519313216E-3,null,-4.5623438360276047E-3,null,"Geometric Mean",-6.5419258410472914E-3,-3.663958924025823E-3,null,-2.5071562704247929E-2]
[]
[]
[null,null,null,"Calendar Year",null,"Revenues",null,null,null,null,{"$f":"IF(ISBLANK(N127),\"\",CONCATENATE(\"Demand (\",N127,\")\"))","v":"Demand (kWh)"},null,null,null,null,null,{"$f":"CONCATENATE(\"Demand (\",N127,\") per \",LEFT(F129,LEN(F129)-1))","v":"Demand (kWh) per Customer"}]
[null,null,null,{"$f":"CONCATENATE(\"(for \",TestYear,\" Cost of Service\")","v":"(for 2018 Cost of Service"},null,null,null,null,null,null,null,"Actual (Weather actual)","Weather-normalized",null,{"$f":"M151","v":"Weather-normalized"},null,null,{"$f":"L151","v":"Actual (Weather actual)"},{"$f":"M151","v":"Weather-normalized"},null,{"$f":"O151","v":"Weather-normalized"}]
[null,null,"Historical",{"$f":"D153-1","v":2012},null,{"$f":"F131","v":"Actual"},null,"",null,null,{"$f":"K131","v":"Actual"},null,null,{"$f":"N131","v":""},null,null,{"$f":"K152","v":"Actual"},{"$f":"IF(G152=0,\"\",L152/G152)","v":""},{"$f":"IF(G152=0,\"\",M152/G152)","v":""},{"$f":"N152","v":""},{"$f":"IF(T152=\"\",\"\",IF(I152=0,\"\",O152/I152))","v":""}]
[null,null,"Historical",2013,null,"Actual",null,"Board-approved",1149106.0873975682,null,"Actual",null,null,"Board-approved",null,null,{"$f":"K153","v":"Actual"},{"$f":"IF(G153=0,\"\",L153/G153)","v":""},{"$f":"IF(G153=0,\"\",M153/G153)","v":""},{"$f":"N153","v":"Board-approved"},{"$f":"IF(T153=\"\",\"\",IF(I153=0,\"\",O153/I153))","v":0}]
[null,null,"Historical",2014,null,"Actual",null,"",null,null,"Actual",null,null,"",null,null,"Actual","","","",""]
[null,null,"Historical",2015,null,"Actual",null,"",null,null,"Actual",null,null,"",null,null,"Actual","","","",""]
[null,null,"Historical",2016,null,"Actual",null,"",null,null,"Actual",null,null,"",null,null,"Actual","","","",""]
[null,null,"Bridge Year (Forecast)",2017,null,"Forecast",null,"",null,null,"Forecast",null,null,"",null,null,"Forecast","","","",""]
[null,null,"Test Year (Forecast)",{"$f":"TestYear","v":2018},null,"Forecast",1275038.48,"",null,null,"Forecast",null,null,"",null,null,"Forecast",0,0,"",""]
[null,null,null,null,null,null,null,null,1149106.0873975682,null,null,null,null,null,{"$f":"SUM(O152:O157)","v":0},null,null,null,null,null,{"$f":"SUM(U152:U157)","v":0}]
[null,null,"Variance Analysis","Year",null,null,"Year-over-year",null,"Test Year Versus Board-approved",null,"Year","Year-over-year",null,null,{"$f":"I160","v":"Test Year Versus Board-approved"},null,"Year","Year-over-year",null,null,{"$f":"O160","v":"Test Year Versus Board-approved"}]
[null,null,null,{"$f":"D152","v":2012},null,null,null,null,null,null,{"$f":"D161","v":2012},null,null,null,null,null,{"$f":"K161","v":2012}]
[null,null,null,2013,null,null,"",null,null,null,{"$f":"D162","v":2013},{"$f":"IF(L152=0,\"\",L153/L152-1)","v":""},"",null,null,null,{"$f":"K162","v":2013},{"$f":"IF(R152=\"\",\"\",IF(R152=0,\"\",R153/R152-1))","v":""},""]
[null,null,null,2014,null,null,"",null,null,null,2014,"","",null,null,null,2014,"",""]
[null,null,null,2015,null,null,"",null,null,null,2015,"","",null,null,null,2015,"",""]
[null,null,null,2016,null,null,"",null,null,null,2016,{"$f":"IF(L155=0,\"\",L156/L155-1)","v":""},"",null,null,null,2016,{"$f":"IF(R155=\"\",\"\",IF(R155=0,\"\",R156/R155-1))","v":""},""]
[null,null,null,2017,null,null,"",null,null,null,2017,{"$f":"IF(K157=\"Forecast\",\"\",IF(L156=0,\"\",L157/L156-1))","v":""},"",null,null,null,2017,{"$f":"IF(Q157=\"Forecast\",\"\",IF(R156=0,\"\",R157/R156-1))","v":""},""]
[null,null,null,2018,null,null,"",null,0.10959161559019903,null,2018,{"$f":"IF(K158=\"Forecast\",\"\",IF(L157=0,\"\",L158/L157-1))","v":""},"",null,{"$f":"IF(O159=0,\"\",M158/O159-1)","v":""},null,2018,{"$f":"IF(Q158=\"Forecast\",\"\",IF(R157=0,\"\",R158/R157-1))","v":""},"",null,{"$f":"IF(U159=0,\"\",S158/U159-1)","v":""}]
[null,null,null,"Geometric Mean",null,null,"",null,2.6338904451952416E-2,null,"Geometric Mean",{"$f":"IF(L152=0,\"\",(L156/L152)^(1/($D156-$D152-1))-1)","v":""},{"$f":"IF(M152=0,\"\",(M158/M152)^(1/($D158-$D152-1))-1)","v":""},null,{"$f":"IF(O159=0,\"\",(M158/O159)^(1/(TestYear-RebaseYear-1))-1)","v":""},null,"Geometric Mean",{"$f":"IF(R152=\"\",\"\",IF(R152=0,\"\",(R156/R152)^(1/($D156-$D152-1))-1))","v":""},{"$f":"IF(S152=\"\",\"\",IF(S152=0,\"\",(S158/S152)^(1/($D158-$D152-1))-1))","v":""},null,{"$f":"IF(U159=0,\"\",(S158/U159)^(1/(TestYear-RebaseYear-1))-1)","v":""}]
[]
[]
[]
[]
[]
[]
[]
[]
[]
[]
[]
[]
[]
[]
[]
[]
[]
[]
[]
[null,3,"Customer Class:","GS > 50 kW",null,null,null,"Is the customer class billed on consumption (kWh) or demand (kW or kVA)?",null,null,null,null,null,"kW"]
[]
[null,null,null,"Calendar Year",null,"Customers",null,null,null,null,"Consumption (kWh) (3)",null,null,null,null,null,{"$f":"CONCATENATE(\"Consumption (kWh) per \",LEFT(F190,LEN(F190)-1))","v":"Consumption (kWh) per Customer"}]
[null,null,null,{"$f":"CONCATENATE(\"(for \",TestYear,\" Cost of Service\")","v":"(for 2018 Cost of Service"},null,null,null,null,null,null,null,"Actual (Weather actual)","Weather-normalized",null,"Weather-normalized",null,null,{"$f":"L191","v":"Actual (Weather actual)"},{"$f":"M191","v":"Weather-normalized"},null,{"$f":"O191","v":"Weather-normalized"}]
[null,null,"Historical",{"$f":"D193-1","v":2012},null,{"$f":"F131","v":"Actual"},187.33333333333334,"",null,null,{"$f":"F192","v":"Actual"},102465298.45290981,102465298.45290981,"",null,null,{"$f":"K192","v":"Actual"},546967.78533581749,546967.78533581749,"",""]
[null,null,"Historical",2013,null,"Actual",185.41666666666666,"Board-approved",175,null,{"$f":"F193","v":"Actual"},99138274.685914725,99138274.685914725,"Board-approved",77849023,null,{"$f":"K193","v":"Actual"},534678.33538470871,534678.33538470871,"Board-approved",84.870169185060462]
[null,null,"Historical",2014,null,"Actual",180.66666666666666,"",null,null,"Actual",103487653.65599824,103487653.65599824,"",null,null,"Actual",572809.89108486113,572809.89108486113,"",""]
[null,null,"Historical",2015,null,"Actual",155.25,"",null,null,"Actual",97248975.133685857,97248975.133685902,"",null,null,"Actual",626402.41632003768,626402.41632003803,"",""]
[null,null,"Historical",2016,null,"Actual",157.75,"",null,null,"Actual",101805844.79446088,101805844.79446088,"",null,null,"Actual",645361.93213604356,645361.93213604356,"",""]
[null,null,"Bridge Year",2017,null,"Forecast",155.41422980347329,"",null,null,"Forecast",null,90450055.597037882,"",null,null,"Forecast",0,581993.39733186038,"",""]
[null,null,"Test Year",{"$f":"TestYear","v":2018},null,"Forecast",153.1130448520241,"",null,null,"Forecast",null,89222068.992669106,"",null,null,"Forecast",0,582720.23183196213,"",""]
[null,null,null,null,null,null,null,null,175,null,null,null,null,null,{"$f":"SUM(O192:O197)","v":77849023},null,null,null,null,null,{"$f":"SUM(U192:U197)","v":84.870169185060462}]
[null,null,"Variance Analysis","Year",null,null,"Year-over-year",null,"Test Year Versus Board-approved",null,"Year","Year-over-year",null,null,{"$f":"I200","v":"Test Year Versus Board-approved"},null,"Year","Year-over-year",null,null,{"$f":"O200","v":"Test Year Versus Board-approved"}]
[null,null,null,{"$f":"D192","v":2012},null,null,null,null,null,null,{"$f":"D201","v":2012},null,null,null,null,null,{"$f":"K201","v":2012}]
[null,null,null,2013,null,null,-1.0231316725978767E-2,null,null,null,{"$f":"D202","v":2013},-3.2469761150640597E-2,-3.2469761150640597E-2,null,null,null,{"$f":"K202","v":2013},-2.2468324973770715E-2,-2.2468324973770715E-2]
[null,null,null,2014,null,null,-2.5617977528089919E-2,null,null,null,2014,4.3871844490566581E-2,4.3871844490566581E-2,null,null,null,2014,7.1316814571729781E-2,7.1316814571729781E-2]
[null,null,null,2015,null,null,-0.14068265682656822,null,null,null,2015,-6.0284278384069689E-2,-6.0284278384069245E-2,null,null,null,2015,9.3560753871892999E-2,9.3560753871893665E-2]
[null,null,null,2016,null,null,1.6103059581320522E-2,null,null,null,2016,4.6857765385298844E-2,4.68577653852984E-2,null,null,null,2016,3.0267309515484397E-2,3.0267309515483731E-2]
[null,null,null,2017,null,null,-1.4806784130121819E-2,null,null,null,2017,"",-0.11154358789860808,null,null,null,2017,"",-9.8190692150749603E-2]
[null,null,null,2018,null,null,-1.4806784130121931E-2,null,-0.1250683151312908,null,2018,"",-1.3576405191386032E-2,null,0.1460910561802311,null,2018,"",1.2488706975610775E-3,null,6865.0194439029974]
[null,null,null,"Geometric Mean",null,null,-3.953968195782076E-2,null,-3.2850668196965471E-2,null,"Geometric Mean",-2.1499098347275147E-3,-2.7299596295848105E-2,null,3.467696583630886E-2,null,"Geometric Mean",5.6689029321435491E-2,1.2743978519511368E-2,null,8.1028263342410121]
[]
[]
[null,null,null,"Calendar Year",null,"Revenues",null,null,null,null,{"$f":"IF(ISBLANK(N188),\"\",CONCATENATE(\"Demand (\",N188,\")\"))","v":"Demand (kW)"},null,null,null,null,null,{"$f":"CONCATENATE(\"Demand (\",N188,\") per \",LEFT(F190,LEN(F190)-1))","v":"Demand (kW) per Customer"}]
[null,null,null,{"$f":"CONCATENATE(\"(for \",TestYear,\" Cost of Service\")","v":"(for 2018 Cost of Service"},null,null,null,null,null,null,null,"Actual (Weather actual)","Weather-normalized",null,{"$f":"M212","v":"Weather-normalized"},null,null,{"$f":"L212","v":"Actual (Weather actual)"},{"$f":"M212","v":"Weather-normalized"},null,{"$f":"O212","v":"Weather-normalized"}]
[null,null,"Historical",{"$f":"D214-1","v":2012},null,{"$f":"F192","v":"Actual"},null,"",null,null,{"$f":"K192","v":"Actual"},319837.02,319837.02,"",null,null,{"$f":"K213","v":"Actual"},"","","",""]
[null,null,"Historical",2013,null,"Actual",null,"Board-approved",917271.91953923448,null,"Actual",299743.55,299743.55,"Board-approved",227921,null,{"$f":"K214","v":"Actual"},"","","Board-approved"]
[null,null,"Historical",2014,null,"Actual",null,"",null,null,"Actual",305695.86,305695.86,"",null,null,"Actual","","","",""]
[null,null,"Historical",2015,null,"Actual",null,"",null,null,"Actual",207631.15,207631.15,"",null,null,"Actual","","","",""]
[null,null,"Historical",2016,null,"Actual",null,"",null,null,"Actual",285017.5,285017.5,"",null,null,"Actual","","","",""]
[null,null,"Bridge Year (Forecast)",2017,null,"Forecast",null,"",null,null,"Forecast",null,272521.54098608141,"",null,null,"Forecast","","","",""]
[null,null,"Test Year (Forecast)",{"$f":"TestYear","v":2018},null,"Forecast",812154.69,"",null,null,"Forecast",null,269752.39812227344,"",null,null,"Forecast",0,0.3321441117606222,"",""]
[null,null,null,null,null,null,null,null,917271.91953923448,null,null,null,null,null,{"$f":"SUM(O213:O218)","v":227921},null,null,null,null,null,{"$f":"SUM(U213:U218)","v":0}]
[null,null,"Variance Analysis","Year",null,null,"Year-over-year",null,"Test Year Versus Board-approved",null,"Year","Year-over-year",null,null,{"$f":"I221","v":"Test Year Versus Board-approved"},null,"Year","Year-over-year",null,null,{"$f":"O221","v":"Test Year Versus Board-approved"}]
[null,null,null,{"$f":"D213","v":2012},null,null,null,null,null,null,{"$f":"D222","v":2012},null,null,null,null,null,{"$f":"K222","v":2012}]
[null,null,null,2013,null,null,"",null,null,null,{"$f":"D223","v":2013},-6.2824090844768476E-2,-6.2824090844768476E-2,null,null,null,{"$f":"K223","v":2013},{"$f":"IF(R213=\"\",\"\",IF(R213=0,\"\",R214/R213-1))","v":""},""]
[null,null,null,2014,null,null,"",null,null,null,2014,1.9858008621036261E-2,1.9858008621036261E-2,null,null,null,2014,"",""]
[null,null,null,2015,null,null,"",null,null,null,2015,-0.32079175033642915,-0.32079175033642915,null,null,null,2015,"",""]
[null,null,null,2016,null,null,"",null,null,null,2016,0.37271069393971001,0.37271069393971001,null,null,null,2016,"",""]
[null,null,null,2017,null,null,"",null,null,null,2017,"",-4.3842778123864612E-2,null,null,null,2017,{"$f":"IF(Q218=\"Forecast\",\"\",IF(R217=0,\"\",R218/R217-1))","v":""},{"$f":"IF(S217=\"\",\"\",IF(S217=0,\"\",S218/S217-1))","v":""}]
[null,null,null,2018,null,null,"",null,-0.11459767523684494,null,2018,"",-1.0161188923958897E-2,null,0.18353463753789012,null,2018,{"$f":"IF(Q219=\"Forecast\",\"\",IF(R218=0,\"\",R219/R218-1))","v":""},{"$f":"IF(S218=\"\",\"\",IF(S218=0,\"\",S219/S218-1))","v":""},null,{"$f":"IF(U220=0,\"\",S219/U220-1)","v":""}]
[null,null,null,"Geometric Mean",null,null,"",null,-2.9970003034159531E-2,null,"Geometric Mean",-3.7691625322776812E-2,-3.3487852490958869E-2,null,4.3026261116476006E-2,null,"Geometric Mean",{"$f":"IF(R213=\"\",\"\",IF(R213=0,\"\",(R217/R213)^(1/($D217-$D213-1))-1))","v":""},{"$f":"IF(S213=\"\",\"\",IF(S213=0,\"\",(S219/S213)^(1/($D219-$D213-1))-1))","v":""},null,{"$f":"IF(U220=0,\"\",(S219/U220)^(1/(TestYear-RebaseYear-1))-1)","v":""}]
[]
[]
[]
[]
[]
[]
[]
[]
[]
[]
[]
[]
[]
[]
[]
[]
[]
[]
[]
[]
[null,4,"Customer Class:","Intermediate",null,null,null,"Is the customer class billed on consumption (kWh) or demand (kW or kVA)?",null,null,null,null,null,"kW"]
[]
[null,null,null,"Calendar Year",null,"Customers",null,null,null,null,"Consumption (kWh) (3)",null,null,null,null,null,{"$f":"CONCATENATE(\"Consumption (kWh) per \",LEFT(F252,LEN(F252)-1))","v":"Consumption (kWh) per Customer"}]
[null,null,null,{"$f":"CONCATENATE(\"(for \",TestYear,\" Cost of Service\")","v":"(for 2018 Cost of Service"},null,null,null,null,null,null,null,"Actual (Weather actual)","Weather-normalized",null,"Weather-normalized",null,null,{"$f":"L253","v":"Actual (Weather actual)"},{"$f":"M253","v":"Weather-normalized"},null,{"$f":"O253","v":"Weather-normalized"}]
[null,null,"Historical",{"$f":"D255-1","v":2012},null,{"$f":"F192","v":"Actual"},7,"",null,null,{"$f":"F254","v":"Actual"},90258341.319999993,90258341.319999993,"",null,null,{"$f":"K254","v":"Actual"},{"$f":"IF(G254=0,\"\",L254/G254)","v":12894048.76},{"$f":"IF(G254=0,\"\",M254/G254)","v":12894048.76},{"$f":"N254","v":""},{"$f":"IF(T254=\"\",\"\",IF(I254=0,\"\",O254/I254))","v":""}]
[null,null,"Historical",2013,null,"Actual",7,"Board-approved",7,null,{"$f":"F255","v":"Actual"},89583306.361000001,89583306.361000001,"Board-approved",69200000,null,{"$f":"K255","v":"Actual"},{"$f":"IF(G255=0,\"\",L255/G255)","v":12797615.194428572},{"$f":"IF(G255=0,\"\",M255/G255)","v":12797615.194428572},{"$f":"N255","v":"Board-approved"},{"$f":"IF(T255=\"\",\"\",IF(I255=0,\"\",O255/I255))","v":9885714.2857142854}]
[null,null,"Historical",2014,null,"Actual",7,"",null,null,"Actual",89565187.659999982,89565187.659999982,"",null,null,"Actual",12795026.808571426,12795026.808571426,"",""]
[null,null,"Historical",2015,null,"Actual",7,"",null,null,"Actual",85452092.269999996,85452092.269999996,"",null,null,"Actual",12207441.752857143,12207441.752857143,"",""]
[null,null,"Historical",2016,null,"Actual",7,"",null,null,"Actual",74711534.260000005,74711534.260000005,"",null,null,"Actual",10673076.322857143,10673076.322857143,"",""]
[null,null,"Bridge Year",2017,null,"Forecast",7,"",null,null,"Forecast",null,84528325.194153056,"",null,null,"Forecast",0,12075475.027736152,"",""]
[null,null,"Test Year",{"$f":"TestYear","v":2018},null,"Forecast",6,"",null,null,"Forecast",null,76967386.167912036,"",null,null,"Forecast",0,12827897.694652006,"",""]
[null,null,null,null,null,null,null,null,{"$f":"SUM(I254:I259)","v":7},null,null,null,null,null,{"$f":"SUM(O254:O259)","v":69200000},null,null,null,null,null,{"$f":"SUM(U254:U259)","v":9885714.2857142854}]
[null,null,"Variance Analysis","Year",null,null,"Year-over-year",null,"Test Year Versus Board-approved",null,"Year","Year-over-year",null,null,{"$f":"I262","v":"Test Year Versus Board-approved"},null,"Year","Year-over-year",null,null,{"$f":"O262","v":"Test Year Versus Board-approved"}]
[null,null,null,{"$f":"D254","v":2012},null,null,null,null,null,null,{"$f":"D263","v":2012},null,null,null,null,null,{"$f":"K263","v":2012}]
[null,null,null,2013,null,null,0,null,null,null,{"$f":"D264","v":2013},-7.4789204978489288E-3,-7.4789204978489288E-3,null,null,null,{"$f":"K264","v":2013},-7.4789204978489288E-3,-7.4789204978489288E-3]
[null,null,null,2014,null,null,0,null,null,null,2014,-2.0225532787332412E-4,-2.0225532787332412E-4,null,null,null,2014,-2.0225532787332412E-4,-2.0225532787332412E-4]
[null,null,null,2015,null,null,0,null,null,null,2015,-4.5922924938356369E-2,-4.5922924938356369E-2,null,null,null,2015,-4.5922924938356369E-2,-4.5922924938356369E-2]
[null,null,null,2016,null,null,0,null,null,null,2016,-0.1256909892394843,-0.1256909892394843,null,null,null,2016,-0.12569098923948441,-0.12569098923948441]
[null,null,null,2017,null,null,0,null,null,null,2017,"",0.13139592208065376,null,null,null,2017,"",0.13139592208065376]
[null,null,null,2018,null,null,-0.1428571428571429,null,-0.1428571428571429,null,2018,"",-8.9448584351746074E-2,null,0.11224546485422016,null,2018,"",6.2309984922962913E-2,null,0.29761970899659018]
[null,null,null,"Geometric Mean",null,null,-3.0359733904420927E-2,null,-3.7804541804238534E-2,null,"Geometric Mean",-6.1069524189714564E-2,-3.1356701955160715E-2,null,2.6952037513389593E-2,null,"Geometric Mean",-6.1069524189714675E-2,-1.0281834259567857E-3,null,6.7300857394458014E-2]
[]
[]
[null,null,null,"Calendar Year",null,"Revenues",null,null,null,null,{"$f":"IF(ISBLANK(N250),\"\",CONCATENATE(\"Demand (\",N250,\")\"))","v":"Demand (kW)"},null,null,null,null,null,{"$f":"CONCATENATE(\"Demand (\",N250,\") per \",LEFT(F252,LEN(F252)-1))","v":"Demand (kW) per Customer"}]
[null,null,null,{"$f":"CONCATENATE(\"(for \",TestYear,\" Cost of Service\")","v":"(for 2018 Cost of Service"},null,null,null,null,null,null,null,"Actual (Weather actual)","Weather-normalized",null,{"$f":"M274","v":"Weather-normalized"},null,null,{"$f":"L274","v":"Actual (Weather actual)"},{"$f":"M274","v":"Weather-normalized"},null,{"$f":"O274","v":"Weather-normalized"}]
[null,null,"Historical",{"$f":"D276-1","v":2012},null,{"$f":"F254","v":"Actual"},null,"",null,null,{"$f":"K254","v":"Actual"},188608.40000000002,188608.40000000002,"",null,null,{"$f":"K275","v":"Actual"},{"$f":"IF(G275=0,\"\",L275/G275)","v":""},{"$f":"IF(G275=0,\"\",M275/G275)","v":""},{"$f":"N275","v":""},{"$f":"IF(T275=\"\",\"\",IF(I275=0,\"\",O275/I275))","v":""}]
[null,null,"Historical",2013,null,"Actual",null,"Board-approved",584380.59907964291,null,"Actual",186063.38999999998,186063.38999999998,"Board-approved",123604,null,{"$f":"K276","v":"Actual"},{"$f":"IF(G276=0,\"\",L276/G276)","v":""},{"$f":"IF(G276=0,\"\",M276/G276)","v":""},{"$f":"N276","v":"Board-approved"},{"$f":"IF(T276=\"\",\"\",IF(I276=0,\"\",O276/I276))","v":0.21151283973949056}]
[null,null,"Historical",2014,null,"Actual",null,"",null,null,"Actual",173701.3,173701.3,"",null,null,"Actual","","","",""]
[null,null,"Historical",2015,null,"Actual",null,"",null,null,"Actual",203107.54000000004,203107.54000000004,"",null,null,"Actual","","","",""]
[null,null,"Historical",2016,null,"Actual",null,"",null,null,"Actual",186368.7,186368.7,"",null,null,"Actual","","","",""]
[null,null,"Bridge Year (Forecast)",2017,null,"Forecast",null,"",null,null,"Forecast",null,183627.93860585493,"",null,null,"Forecast","","","",""]
[null,null,"Test Year (Forecast)",{"$f":"TestYear","v":2018},null,"Forecast",501055.39,"",null,null,"Forecast",null,165381.72877488722,"",null,null,"Forecast",0,0.33006675923571488,"",""]
[null,null,null,null,null,null,null,null,{"$f":"SUM(I275:I280)","v":584380.59907964291},null,null,null,null,null,{"$f":"SUM(O275:O280)","v":123604},null,null,null,null,null,{"$f":"SUM(U275:U280)","v":0.21151283973949056}]
[null,null,"Variance Analysis","Year",null,null,"Year-over-year",null,{"$f":"I262","v":"Test Year Versus Board-approved"},null,"Year","Year-over-year",null,null,{"$f":"I283","v":"Test Year Versus Board-approved"},null,"Year","Year-over-year",null,null,{"$f":"O283","v":"Test Year Versus Board-approved"}]
[null,null,null,{"$f":"D275","v":2012},null,null,null,null,null,null,{"$f":"D284","v":2012},null,null,null,null,null,{"$f":"K284","v":2012},"Large User"]
[null,null,null,2013,null,null,"",null,null,null,{"$f":"D285","v":2013},-1.3493619584281746E-2,-1.3493619584281746E-2,null,null,null,{"$f":"K285","v":2013},"",""]
[null,null,null,2014,null,null,"",null,null,null,2014,-6.6440206211442199E-2,-6.6440206211442199E-2,null,null,null,2014,"",""]
[null,null,null,2015,null,null,"",null,null,null,2015,0.16929199723893862,0.16929199723893862,null,null,null,2015,"",""]
[null,null,null,2016,null,null,"",null,null,null,2016,-8.2413680949510848E-2,-8.2413680949510848E-2,null,null,null,2016,"",""]
[null,null,null,2017,null,null,"",null,null,null,2017,"",-1.4706124977773016E-2,null,null,null,2017,"",""]
[null,null,null,2018,null,null,"",null,-0.14258722690464753,null,2018,"",-9.9365107344215109E-2,null,0.33799657595941257,null,2018,"","",null,0.56050459935312236]
[null,null,null,"Geometric Mean",null,null,"",null,-3.7728801442484583E-2,null,"Geometric Mean",-3.9740618383966586E-3,-2.5940919581219579E-2,null,7.5508260873685229E-2,null,"Geometric Mean","","",null,0.11767686956225742]
[]
[]
[]
[]
[]
[]
[]
[]
[]
[]
[]
[]
[]
[]
[]
[]
[]
[]
[]
[]
[]
[null,5,"Customer Class:","Large User",null,null,null,"Is the customer class billed on consumption (kWh) or demand (kW or kVA)?",null,null,null,null,null,"kWh"]
[]
[null,null,null,"Calendar Year",null,"Customers",null,null,null,null,"Consumption (kWh) (3)",null,null,null,null,null,{"$f":"CONCATENATE(\"Consumption (kWh) per \",LEFT(F315,LEN(F315)-1))","v":"Consumption (kWh) per Customer"}]
[null,null,null,{"$f":"CONCATENATE(\"(for \",TestYear,\" Cost of Service\")","v":"(for 2018 Cost of Service"},null,null,null,null,null,null,null,"Actual (Weather actual)","Weather-normalized",null,"Weather-normalized",null,null,{"$f":"L316","v":"Actual (Weather actual)"},{"$f":"M316","v":"Weather-normalized"},null,{"$f":"O316","v":"Weather-normalized"}]
[null,null,"Historical",{"$f":"D318-1","v":2012},null,{"$f":"F254","v":"Actual"},1,"",null,null,{"$f":"F317","v":"Actual"},94151552.840000004,94151552.840000004,"",null,null,{"$f":"K317","v":"Actual"},{"$f":"IF(G317=0,\"\",L317/G317)","v":94151552.840000004},{"$f":"IF(G317=0,\"\",M317/G317)","v":94151552.840000004},{"$f":"N317","v":""},{"$f":"IF(T317=\"\",\"\",IF(I317=0,\"\",O317/I317))","v":""}]
[null,null,"Historical",2013,null,"Actual",1,"Board-approved",1,null,{"$f":"F318","v":"Actual"},94970952.530000001,94970952.530000001,"Board-approved",97146783,null,{"$f":"K318","v":"Actual"},{"$f":"IF(G318=0,\"\",L318/G318)","v":94970952.530000001},{"$f":"IF(G318=0,\"\",M318/G318)","v":94970952.530000001},{"$f":"N318","v":"Board-approved"},{"$f":"IF(T318=\"\",\"\",IF(I318=0,\"\",O318/I318))","v":97146783}]
[null,null,"Historical",2014,null,"Actual",1,"",null,null,"Actual",98447966.930000007,98447966.930000007,"",null,null,"Actual",98447966.930000007,98447966.930000007,"",""]
[null,null,"Historical",2015,null,"Actual",1,"",null,null,"Actual",100676054.72000001,100676054.72000001,"",null,null,"Actual",100676054.72000001,100676054.72000001,"",""]
[null,null,"Historical",2016,null,"Actual",1,"",null,null,"Actual",108025611.39,108025611.39,"",null,null,"Actual",108025611.39,108025611.39,"",""]
[null,null,"Bridge Year",2017,null,"Forecast",1,"",null,null,"Forecast",null,98980672.788731128,"",null,null,"Forecast",0,98980672.788731128,"",""]
[null,null,"Test Year",{"$f":"TestYear","v":2018},null,"Forecast",1,"",null,null,"Forecast",null,99199238.609328106,"",null,null,"Forecast",0,99199238.609328106,"",""]
[null,null,null,null,null,null,null,null,1,null,null,null,null,null,{"$f":"SUM(O317:O322)","v":97146783},null,null,null,null,null,{"$f":"SUM(U317:U322)","v":97146783}]
[null,null,"Variance Analysis","Year",null,null,"Year-over-year",null,"Test Year Versus Board-approved",null,"Year","Year-over-year",null,null,{"$f":"I325","v":"Test Year Versus Board-approved"},null,"Year","Year-over-year",null,null,{"$f":"O325","v":"Test Year Versus Board-approved"}]
[null,null,null,{"$f":"D317","v":2012},null,null,null,null,null,null,{"$f":"D326","v":2012},null,null,null,null,null,{"$f":"K326","v":2012}]
[null,null,null,2013,null,null,0,null,null,null,{"$f":"D327","v":2013},8.7029864647316657E-3,8.7029864647316657E-3,null,null,null,{"$f":"K327","v":2013},{"$f":"IF(R317=\"\",\"\",IF(R317=0,\"\",R318/R317-1))","v":8.7029864647316657E-3},8.7029864647316657E-3]
[null,null,null,2014,null,null,0,null,null,null,2014,3.661134596814386E-2,3.661134596814386E-2,null,null,null,2014,3.661134596814386E-2,3.661134596814386E-2]
[null,null,null,2015,null,null,0,null,null,null,2015,2.2632136137298309E-2,2.2632136137298309E-2,null,null,null,2015,2.2632136137298309E-2,2.2632136137298309E-2]
[null,null,null,2016,null,null,0,null,null,null,2016,7.3002033010138856E-2,7.3002033010138856E-2,null,null,null,2016,7.3002033010138856E-2,7.3002033010138856E-2]
[null,null,null,2017,null,null,0,null,null,null,2017,"",-8.3729575652336186E-2,null,null,null,2017,{"$f":"IF(Q322=\"Forecast\",\"\",IF(R321=0,\"\",R322/R321-1))","v":""},{"$f":"IF(S321=\"\",\"\",IF(S321=0,\"\",S322/S321-1))","v":-8.3729575652336186E-2}]
[null,null,null,2018,null,null,0,null,0,null,2018,"",2.2081666494981889E-3,null,2.1127365682588772E-2,null,2018,{"$f":"IF(Q323=\"Forecast\",\"\",IF(R322=0,\"\",R323/R322-1))","v":""},{"$f":"IF(S322=\"\",\"\",IF(S322=0,\"\",S323/S322-1))","v":2.2081666494981889E-3},null,{"$f":"IF(U324=0,\"\",S323/U324-1)","v":2.1127365682588772E-2}]
[null,null,null,"Geometric Mean",null,null,0,null,0,null,"Geometric Mean",4.6886859483797894E-2,1.0499656717422923E-2,null,5.2405030052113943E-3,null,"Geometric Mean",{"$f":"IF(R317=\"\",\"\",IF(R317=0,\"\",(R321/R317)^(1/($D321-$D317-1))-1))","v":4.6886859483797894E-2},{"$f":"IF(S317=\"\",\"\",IF(S317=0,\"\",(S323/S317)^(1/($D323-$D317-1))-1))","v":1.0499656717422923E-2},null,{"$f":"IF(U324=0,\"\",(S323/U324)^(1/(TestYear-RebaseYear-1))-1)","v":4.1902099666160098E-3}]
[]
[]
[null,null,null,"Calendar Year",null,"Revenues",null,null,null,null,{"$f":"IF(ISBLANK(N313),\"\",CONCATENATE(\"Demand (\",N313,\")\"))","v":"Demand (kWh)"},null,null,null,null,null,{"$f":"CONCATENATE(\"Demand (\",N313,\") per \",LEFT(F315,LEN(F315)-1))","v":"Demand (kWh) per Customer"}]
[null,null,null,{"$f":"CONCATENATE(\"(for \",TestYear,\" Cost of Service\")","v":"(for 2018 Cost of Service"},null,null,null,null,null,null,null,"Actual (Weather actual)","Weather-normalized",null,{"$f":"M337","v":"Weather-normalized"},null,null,{"$f":"L337","v":"Actual (Weather actual)"},{"$f":"M337","v":"Weather-normalized"},null,{"$f":"O337","v":"Weather-normalized"}]
[null,null,"Historical",{"$f":"D339-1","v":2012},null,{"$f":"F317","v":"Actual"},null,"",null,null,{"$f":"K317","v":"Actual"},null,null,{"$f":"N317","v":""},null,null,{"$f":"K338","v":"Actual"},{"$f":"IF(G338=0,\"\",L338/G338)","v":""},{"$f":"IF(G338=0,\"\",M338/G338)","v":""},{"$f":"N338","v":""},{"$f":"IF(T338=\"\",\"\",IF(I338=0,\"\",O338/I338))","v":""}]
[null,null,"Historical",2013,null,"Actual",null,"Board-approved",403635.76990429126,null,"Actual",null,null,"Board-approved",null,null,{"$f":"K339","v":"Actual"},{"$f":"IF(G339=0,\"\",L339/G339)","v":""},{"$f":"IF(G339=0,\"\",M339/G339)","v":""},{"$f":"N339","v":"Board-approved"},{"$f":"IF(T339=\"\",\"\",IF(I339=0,\"\",O339/I339))","v":0}]
[null,null,"Historical",2014,null,"Actual",null,"",null,null,"Actual",null,null,"",null,null,"Actual","","","",""]
[null,null,"Historical",2015,null,"Actual",null,"",null,null,"Actual",null,null,"",null,null,"Actual","","","",""]
[null,null,"Historical",2016,null,"Actual",null,"",null,null,"Actual",null,null,"",null,null,"Actual","","","",""]
[null,null,"Bridge Year (Forecast)",2017,null,"Forecast",null,"",null,null,"Forecast",null,null,"",null,null,"Forecast","","","",""]
[null,null,"Test Year (Forecast)",{"$f":"TestYear","v":2018},null,"Forecast",249625.65,"",null,null,"Forecast",null,null,"",null,null,"Forecast",0,0,"",""]
[null,null,null,null,null,null,null,null,{"$f":"SUM(I338:I343)","v":403635.76990429126},null,null,null,null,null,{"$f":"SUM(O338:O343)","v":0},null,null,null,null,null,{"$f":"SUM(U338:U343)","v":0}]
[null,null,"Variance Analysis","Year",null,null,"Year-over-year",null,{"$f":"I325","v":"Test Year Versus Board-approved"},null,"Year","Year-over-year",null,null,{"$f":"I346","v":"Test Year Versus Board-approved"},null,"Year","Year-over-year",null,null,{"$f":"O346","v":"Test Year Versus Board-approved"}]
[null,null,null,{"$f":"D338","v":2012},null,null,null,null,null,null,{"$f":"D347","v":2012},null,null,null,null,null,{"$f":"K347","v":2012}]
[null,null,null,2013,null,null,{"$f":"IF(G338=0,\"\",G339/G338-1)","v":""},null,null,null,{"$f":"D348","v":2013},{"$f":"IF(L338=0,\"\",L339/L338-1)","v":""},"",null,null,null,{"$f":"K348","v":2013},{"$f":"IF(R338=\"\",\"\",IF(R338=0,\"\",R339/R338-1))","v":""},""]
[null,null,null,2014,null,null,"",null,null,null,2014,"","",null,null,null,2014,"",""]
[null,null,null,2015,null,null,"",null,null,null,2015,"","",null,null,null,2015,"",""]
[null,null,null,2016,null,null,"",null,null,null,2016,"","",null,null,null,2016,"",""]
[null,null,null,2017,null,null,"",null,null,null,2017,{"$f":"IF(K343=\"Forecast\",\"\",IF(L342=0,\"\",L343/L342-1))","v":""},{"$f":"IF(M342=0,\"\",M343/M342-1)","v":""},null,null,null,2017,{"$f":"IF(Q343=\"Forecast\",\"\",IF(R342=0,\"\",R343/R342-1))","v":""},{"$f":"IF(S342=\"\",\"\",IF(S342=0,\"\",S343/S342-1))","v":""}]
[null,null,null,2018,null,null,"",null,{"$f":"IF(I345=0,\"\",G344/I345-1)","v":-0.38155716462098888},null,2018,{"$f":"IF(K344=\"Forecast\",\"\",IF(L343=0,\"\",L344/L343-1))","v":""},{"$f":"IF(M343=0,\"\",M344/M343-1)","v":""},null,{"$f":"IF(O345=0,\"\",M344/O345-1)","v":""},null,2018,{"$f":"IF(Q344=\"Forecast\",\"\",IF(R343=0,\"\",R344/R343-1))","v":""},{"$f":"IF(S343=\"\",\"\",IF(S343=0,\"\",S344/S343-1))","v":""},null,{"$f":"IF(U345=0,\"\",S344/U345-1)","v":""}]
[null,null,null,"Geometric Mean",null,null,{"$f":"IF(G338=0,\"\",(G344/G338)^(1/($D344-$D338-1))-1)","v":""},null,{"$f":"IF(I345=0,\"\",(G344/I345)^(1/(TestYear-RebaseYear-1))-1)","v":-9.1636003225772034E-2},null,"Geometric Mean",{"$f":"IF(L338=0,\"\",(L342/L338)^(1/($D342-$D338-1))-1)","v":""},{"$f":"IF(M338=0,\"\",(M344/M338)^(1/($D344-$D338-1))-1)","v":""},null,{"$f":"IF(O345=0,\"\",(M344/O345)^(1/(TestYear-RebaseYear-1))-1)","v":""},null,"Geometric Mean",{"$f":"IF(R338=\"\",\"\",IF(R338=0,\"\",(R342/R338)^(1/($D342-$D338-1))-1))","v":""},{"$f":"IF(S338=\"\",\"\",IF(S338=0,\"\",(S344/S338)^(1/($D344-$D338-1))-1))","v":""},null,{"$f":"IF(U345=0,\"\",(S344/U345)^(1/(TestYear-RebaseYear-1))-1)","v":""}]
[]
[]
[]
[]
[]
[]
[]
[]
[]
[]
[]
[]
[]
[]
[]
[]
[]
[]
[]
[null,{"$f":"B313+1","v":6},"Customer Class:","Unmetered Scattered Load",null,null,null,"Is the customer class billed on consumption (kWh) or demand (kW or kVA)?",null,null,null,null,null,"kWh"]
[]
[null,null,null,"Calendar Year",null,"Customers",null,null,null,null,"Consumption (kWh) (3)",null,null,null,null,null,{"$f":"CONCATENATE(\"Consumption (kWh) per \",LEFT(F376,LEN(F376)-1))","v":"Consumption (kWh) per Customer"}]
[null,null,null,{"$f":"CONCATENATE(\"(for \",TestYear,\" Cost of Service\")","v":"(for 2018 Cost of Service"},null,null,null,null,null,null,null,"Actual (Weather actual)","Weather-normalized",null,"Weather-normalized",null,null,{"$f":"L377","v":"Actual (Weather actual)"},{"$f":"M377","v":"Weather-normalized"},null,{"$f":"O377","v":"Weather-normalized"}]
[null,null,"Historical",{"$f":"D379-1","v":2012},null,{"$f":"F317","v":"Actual"},119.66666666666667,"",null,null,{"$f":"F378","v":"Actual"},513343,513343,"",null,null,{"$f":"K378","v":"Actual"},4289.7743732590525,4289.7743732590525,"",{"$f":"IF(T378=\"\",\"\",IF(I378=0,\"\",O378/I378))","v":""}]
[null,null,"Historical",2013,null,"Actual",123.66666666666667,"Board-approved",121,null,{"$f":"F379","v":"Actual"},539394,539394,"Board-approved",618341,null,{"$f":"K379","v":"Actual"},4361.6765498652294,4361.6765498652294,"Board-approved",{"$f":"IF(T379=\"\",\"\",IF(I379=0,\"\",O379/I379))","v":5110.2561983471078}]
[null,null,"Historical",2014,null,"Actual",120.91666666666667,"",null,null,"Actual",535721,535721,"",null,null,"Actual",4430.4975878704336,4430.4975878704336,"",""]
[null,null,"Historical",2015,null,"Actual",127.66666666666667,"",null,null,"Actual",537894,537894,"",null,null,"Actual",4213.2689295039163,4213.2689295039163,"",""]
[null,null,"Historical",2016,null,"Actual",126.41666666666667,"",null,null,"Actual",504437,504437,"",null,null,"Actual",3990.2729070533946,3990.2729070533946,"",""]
[null,null,"Bridge Year",2017,null,"Forecast",128.05501245348748,"",null,null,"Forecast",null,510974.44680553611,"",null,null,"Forecast",0,3990.2729070533946,"",""]
[null,null,"Test Year",{"$f":"TestYear","v":2018},null,"Forecast",129.71459101750429,"",null,null,"Forecast",null,517596.61818665901,"",null,null,"Forecast",0,3990.2729070533946,"",""]
[null,null,null,null,null,null,null,null,{"$f":"SUM(I378:I383)","v":121},null,null,null,null,null,{"$f":"SUM(O378:O383)","v":618341},null,null,null,null,null,{"$f":"SUM(U378:U383)","v":5110.2561983471078}]
[null,null,"Variance Analysis","Year",null,null,"Year-over-year",null,"Test Year Versus Board-approved",null,"Year","Year-over-year",null,null,{"$f":"I386","v":"Test Year Versus Board-approved"},null,"Year","Year-over-year",null,null,{"$f":"O386","v":"Test Year Versus Board-approved"}]
[null,null,null,{"$f":"D378","v":2012},null,null,null,null,null,null,{"$f":"D387","v":2012},null,null,null,null,null,{"$f":"K387","v":2012}]
[null,null,null,2013,null,null,3.3426183844011081E-2,null,null,null,{"$f":"D388","v":2013},5.0747745659335042E-2,5.0747745659335042E-2,null,null,null,{"$f":"K388","v":2013},1.6761295664963205E-2,1.6761295664963205E-2]
[null,null,null,2014,null,null,-2.2237196765498624E-2,null,null,null,2014,-6.8094936169108555E-3,-6.8094936169108555E-3,null,null,null,2014,1.5778574412476987E-2,1.5778574412476987E-2]
[null,null,null,2015,null,null,5.5823569951757301E-2,null,null,null,2015,4.056215828761589E-3,4.056215828761589E-3,null,null,null,2015,-4.9030307331897394E-2,-4.9030307331897394E-2]
[null,null,null,2016,null,null,-9.7911227154047209E-3,null,null,null,2016,-6.2199987358104059E-2,-6.2199987358104059E-2,null,null,null,2016,-5.2927080179706931E-2,-5.2927080179706931E-2]
[null,null,null,2017,null,null,1.2959887568786854E-2,null,null,null,2017,"",1.2959887568786854E-2,null,null,null,2017,"",0]
[null,null,null,2018,null,null,1.2959887568786854E-2,null,7.2021413367804099E-2,null,2018,"",1.2959887568787076E-2,null,-0.16292689925678705,null,2018,"",0,null,-0.21916382424348257]
[null,null,null,"Geometric Mean",null,null,1.6256010929780462E-2,null,1.753853454013421E-2,null,"Geometric Mean",-5.8167772768507042E-3,1.6517570086602706E-3,null,-4.3487066905854577E-2,null,"Geometric Mean",-2.3836159406321111E-2,-1.4370644565987578E-2,null,-5.9973749764247186E-2]
[]
[]
[null,null,null,"Calendar Year",null,"Revenues",null,null,null,null,{"$f":"IF(ISBLANK(N374),\"\",CONCATENATE(\"Demand (\",N374,\")\"))","v":"Demand (kWh)"},null,null,null,null,null,{"$f":"CONCATENATE(\"Demand (\",N374,\") per \",LEFT(F376,LEN(F376)-1))","v":"Demand (kWh) per Customer"}]
[null,null,null,{"$f":"CONCATENATE(\"(for \",TestYear,\" Cost of Service\")","v":"(for 2018 Cost of Service"},null,null,null,null,null,null,null,"Actual (Weather actual)","Weather-normalized",null,{"$f":"M398","v":"Weather-normalized"},null,null,{"$f":"L398","v":"Actual (Weather actual)"},{"$f":"M398","v":"Weather-normalized"},null,{"$f":"O398","v":"Weather-normalized"}]
[null,null,"Historical",{"$f":"D400-1","v":2012},null,{"$f":"F378","v":"Actual"},null,"",null,null,{"$f":"K378","v":"Actual"},null,null,{"$f":"N378","v":""},null,null,{"$f":"K399","v":"Actual"},{"$f":"IF(G399=0,\"\",L399/G399)","v":""},{"$f":"IF(G399=0,\"\",M399/G399)","v":""},{"$f":"N399","v":""},{"$f":"IF(T399=\"\",\"\",IF(I399=0,\"\",O399/I399))","v":""}]
[null,null,"Historical",2013,null,"Actual",null,"Board-approved",70761.888562978987,null,"Actual",null,null,"Board-approved",null,null,{"$f":"K400","v":"Actual"},{"$f":"IF(G400=0,\"\",L400/G400)","v":""},{"$f":"IF(G400=0,\"\",M400/G400)","v":""},{"$f":"N400","v":"Board-approved"},{"$f":"IF(T400=\"\",\"\",IF(I400=0,\"\",O400/I400))","v":0}]
[null,null,"Historical",2014,null,"Actual",null,"",null,null,"Actual",null,null,"",null,null,"Actual","","","",""]
[null,null,"Historical",2015,null,"Actual",null,"",null,null,"Actual",null,null,"",null,null,"Actual","","","",""]
[null,null,"Historical",2016,null,"Actual",null,"",null,null,"Actual",null,null,"",null,null,"Actual","","","",""]
[null,null,"Bridge Year (Forecast)",2017,null,"Forecast",null,"",null,null,"Forecast",null,null,"",null,null,"Forecast","","","",""]
[null,null,"Test Year (Forecast)",{"$f":"TestYear","v":2018},null,"Forecast",45132.63,"",null,null,"Forecast",null,null,"",null,null,"Forecast",0,0,"",""]
[null,null,null,null,null,null,null,null,{"$f":"SUM(I399:I404)","v":70761.888562978987},null,null,null,null,null,{"$f":"SUM(O399:O404)","v":0},null,null,null,null,null,{"$f":"SUM(U399:U404)","v":0}]
[null,null,"Variance Analysis","Year",null,null,"Year-over-year",null,{"$f":"I386","v":"Test Year Versus Board-approved"},null,"Year","Year-over-year",null,null,{"$f":"I407","v":"Test Year Versus Board-approved"},null,"Year","Year-over-year",null,null,{"$f":"O407","v":"Test Year Versus Board-approved"}]
[null,null,null,{"$f":"D399","v":2012},null,null,null,null,null,null,{"$f":"D408","v":2012},null,null,null,null,null,{"$f":"K408","v":2012}]
[null,null,null,2013,null,null,"",null,null,null,{"$f":"D409","v":2013},{"$f":"IF(L399=0,\"\",L400/L399-1)","v":""},"",null,null,null,{"$f":"K409","v":2013},{"$f":"IF(R399=\"\",\"\",IF(R399=0,\"\",R400/R399-1))","v":""},""]
[null,null,null,2014,null,null,"",null,null,null,2014,"","",null,null,null,2014,"",""]
[null,null,null,2015,null,null,"",null,null,null,2015,"","",null,null,null,2015,"",""]
[null,null,null,2016,null,null,"",null,null,null,2016,"","",null,null,null,2016,"",""]
[null,null,null,2017,null,null,"",null,null,null,2017,{"$f":"IF(K404=\"Forecast\",\"\",IF(L403=0,\"\",L404/L403-1))","v":""},{"$f":"IF(M403=0,\"\",M404/M403-1)","v":""},null,null,null,2017,{"$f":"IF(Q404=\"Forecast\",\"\",IF(R403=0,\"\",R404/R403-1))","v":""},{"$f":"IF(S403=\"\",\"\",IF(S403=0,\"\",S404/S403-1))","v":""}]
[null,null,null,2018,null,null,"",null,-0.36219014335900068,null,2018,{"$f":"IF(K405=\"Forecast\",\"\",IF(L404=0,\"\",L405/L404-1))","v":""},{"$f":"IF(M404=0,\"\",M405/M404-1)","v":""},null,{"$f":"IF(O406=0,\"\",M405/O406-1)","v":""},null,2018,{"$f":"IF(Q405=\"Forecast\",\"\",IF(R404=0,\"\",R405/R404-1))","v":""},{"$f":"IF(S404=\"\",\"\",IF(S404=0,\"\",S405/S404-1))","v":""},null,{"$f":"IF(U406=0,\"\",S405/U406-1)","v":""}]
[null,null,null,"Geometric Mean",null,null,"",null,-0.10633899754078791,null,"Geometric Mean",{"$f":"IF(L399=0,\"\",(L403/L399)^(1/($D403-$D399-1))-1)","v":""},{"$f":"IF(M399=0,\"\",(M405/M399)^(1/($D405-$D399-1))-1)","v":""},null,{"$f":"IF(O406=0,\"\",(M405/O406)^(1/(TestYear-RebaseYear-1))-1)","v":""},null,"Geometric Mean",{"$f":"IF(R399=\"\",\"\",IF(R399=0,\"\",(R403/R399)^(1/($D403-$D399-1))-1))","v":""},{"$f":"IF(S399=\"\",\"\",IF(S399=0,\"\",(S405/S399)^(1/($D405-$D399-1))-1))","v":""},null,{"$f":"IF(U406=0,\"\",(S405/U406)^(1/(TestYear-RebaseYear-1))-1)","v":""}]
[]
[]
[]
[]
[]
[]
[]
[]
[]
[]
[]
[]
[]
[]
[]
[]
[]
[]
[null,{"$f":"B374+1","v":7},"Customer Class:","Sentinel Lighting",null,null,null,"Is the customer class billed on consumption (kWh) or demand (kW or kVA)?",null,null,null,null,null,"kW"]
[]
[null,null,null,"Calendar Year",null,"Customers",null,null,null,null,"Consumption (kWh) (3)",null,null,null,null,null,{"$f":"CONCATENATE(\"Consumption (kWh) per \",LEFT(F436,LEN(F436)-1))","v":"Consumption (kWh) per Customer"}]
[null,null,null,{"$f":"CONCATENATE(\"(for \",TestYear,\" Cost of Service\")","v":"(for 2018 Cost of Service"},null,null,null,null,null,null,null,"Actual (Weather actual)","Weather-normalized",null,"Weather-normalized",null,null,{"$f":"L437","v":"Actual (Weather actual)"},{"$f":"M437","v":"Weather-normalized"},null,{"$f":"O437","v":"Weather-normalized"}]
[null,null,"Historical",{"$f":"D439-1","v":2012},null,{"$f":"F378","v":"Actual"},301,"",null,null,{"$f":"F438","v":"Actual"},280909.51,280909.51,"",null,null,{"$f":"K438","v":"Actual"},933.25418604651168,933.25418604651168,"",""]
[null,null,"Historical",2013,null,"Actual",248,"Board-approved",301,null,{"$f":"F439","v":"Actual"},272741.7,272741.7,"Board-approved",274492,null,{"$f":"K439","v":"Actual"},1099.7649193548389,1099.7649193548389,"Board-approved",911.93355481727576]
[null,null,"Historical",2014,null,"Actual",248,"",null,null,"Actual",266366.21000000002,266366.21000000002,"",null,null,"Actual",1074.0572983870968,1074.0572983870968,"",""]
[null,null,"Historical",2015,null,"Actual",248,"",null,null,"Actual",246527.76,246527.76,"",null,null,"Actual",994.06354838709683,994.06354838709683,"",""]
[null,null,"Historical",2016,null,"Actual",248,"",null,null,"Actual",231256.11,231256.11,"",null,null,"Actual",932.48431451612896,932.48431451612896,"",""]
[null,null,"Bridge Year",2017,null,"Forecast",242.72001500815873,"",null,null,"Forecast",null,226332.60681422742,"",null,null,"Forecast",0,932.48431451612896,"",""]
[null,null,"Test Year",{"$f":"TestYear","v":2018},null,"Forecast",237.5524422804871,"",null,null,"Forecast",null,221513.9263015523,"",null,null,"Forecast",0,932.48431451612896,"",""]
[null,null,null,null,null,null,null,null,{"$f":"SUM(I438:I443)","v":301},null,null,null,null,null,{"$f":"SUM(O438:O443)","v":274492},null,null,null,null,null,{"$f":"SUM(U438:U443)","v":911.93355481727576}]
[null,null,"Variance Analysis","Year",null,null,"Year-over-year",null,"Test Year Versus Board-approved",null,"Year","Year-over-year",null,null,{"$f":"I446","v":"Test Year Versus Board-approved"},null,"Year","Year-over-year",null,null,{"$f":"O446","v":"Test Year Versus Board-approved"}]
[null,null,null,{"$f":"D438","v":2012},null,null,null,null,null,null,{"$f":"D447","v":2012},null,null,null,null,null,{"$f":"K447","v":2012}]
[null,null,null,2013,null,null,-0.17607973421926915,null,null,null,{"$f":"D448","v":2013},-2.9076302899108009E-2,-2.9076302899108009E-2,null,null,null,{"$f":"K448","v":2013},0.17841948720713119,0.17841948720713119]
[null,null,null,2014,null,null,0,null,null,null,2014,-2.337556009953734E-2,-2.337556009953734E-2,null,null,null,2014,-2.3375560099537562E-2,-2.3375560099537562E-2]
[null,null,null,2015,null,null,0,null,null,null,2015,-7.4478102909524502E-2,-7.4478102909524502E-2,null,null,null,2015,-7.4478102909524391E-2,-7.4478102909524391E-2]
[null,null,null,2016,null,null,0,null,null,null,2016,-6.1946979115049872E-2,-6.1946979115049872E-2,null,null,null,2016,-6.1946979115049872E-2,-6.1946979115049872E-2]
[null,null,null,2017,null,null,-2.1290262063876075E-2,null,null,null,2017,"",-2.1290262063876186E-2,null,null,null,2017,"",0]
[null,null,null,2018,null,null,-2.1290262063876075E-2,null,-0.21078922830402957,null,2018,"",-2.1290262063876075E-2,null,-0.19300407187986424,null,2018,"",0,null,2.2535369589477439E-2]
[null,null,null,"Geometric Mean",null,null,-4.6241106073758198E-2,null,-5.7463340138597108E-2,null,"Geometric Mean",-6.2778467361179424E-2,-4.6398515328402223E-2,null,-5.2197530653227409E-2,null,"Geometric Mean",-2.7505308352560043E-4,-1.6504092978475438E-4,null,5.5868484586520939E-3]
[]
[]
[null,null,null,"Calendar Year",null,"Revenues",null,null,null,null,{"$f":"IF(ISBLANK(N434),\"\",CONCATENATE(\"Demand (\",N434,\")\"))","v":"Demand (kW)"},null,null,null,null,null,{"$f":"CONCATENATE(\"Demand (\",N434,\") per \",LEFT(F436,LEN(F436)-1))","v":"Demand (kW) per Customer"}]
[null,null,null,{"$f":"CONCATENATE(\"(for \",TestYear,\" Cost of Service\")","v":"(for 2018 Cost of Service"},null,null,null,null,null,null,null,"Actual (Weather actual)","Weather-normalized",null,{"$f":"M458","v":"Weather-normalized"},null,null,{"$f":"L458","v":"Actual (Weather actual)"},{"$f":"M458","v":"Weather-normalized"},null,{"$f":"O458","v":"Weather-normalized"}]
[null,null,"Historical",{"$f":"D460-1","v":2012},null,{"$f":"F438","v":"Actual"},null,"",null,null,{"$f":"K438","v":"Actual"},643,643,"",null,null,{"$f":"K459","v":"Actual"},"","","",""]
[null,null,"Historical",2013,null,"Actual",null,"Board-approved",30336.568078626009,null,"Actual",647,647,"Board-approved",772,null,{"$f":"K460","v":"Actual"},"","","Board-approved",2.5447835694503686E-2]
[null,null,"Historical",2014,null,"Actual",null,"",null,null,"Actual",657,657,"",null,null,"Actual","","","",""]
[null,null,"Historical",2015,null,"Actual",null,"",null,null,"Actual",653,653,"",null,null,"Actual","","","",""]
[null,null,"Historical",2016,null,"Actual",null,"",null,null,"Actual",615,615,"",null,null,"Actual","","","",""]
[null,null,"Bridge Year (Forecast)",2017,null,"Forecast",null,"",null,null,"Forecast",null,586.55658158862866,"",null,null,"Forecast","","","",""]
[null,null,"Test Year (Forecast)",{"$f":"TestYear","v":2018},null,"Forecast",46128.41,"",null,null,"Forecast",null,574.06863825131552,"",null,null,"Forecast",0,1.2445012482574524E-2,"",""]
[null,null,null,null,null,null,null,null,{"$f":"SUM(I459:I464)","v":30336.568078626009},null,null,null,null,null,{"$f":"SUM(O459:O464)","v":772},null,null,null,null,null,{"$f":"SUM(U459:U464)","v":2.5447835694503686E-2}]
[null,null,"Variance Analysis","Year",null,null,"Year-over-year",null,{"$f":"I446","v":"Test Year Versus Board-approved"},null,"Year","Year-over-year",null,null,{"$f":"I467","v":"Test Year Versus Board-approved"},null,"Year","Year-over-year",null,null,{"$f":"O467","v":"Test Year Versus Board-approved"}]
[null,null,null,{"$f":"D459","v":2012},null,null,null,null,null,null,{"$f":"D468","v":2012},null,null,null,null,null,{"$f":"K468","v":2012}]
[null,null,null,2013,null,null,"",null,null,null,{"$f":"D469","v":2013},6.2208398133747345E-3,6.2208398133747345E-3,null,null,null,{"$f":"K469","v":2013},"",""]
[null,null,null,2014,null,null,"",null,null,null,2014,1.5455950540958163E-2,1.5455950540958163E-2,null,null,null,2014,"",""]
[null,null,null,2015,null,null,"",null,null,null,2015,-6.0882800608828003E-3,-6.0882800608828003E-3,null,null,null,2015,"",""]
[null,null,null,2016,null,null,"",null,null,null,2016,-5.8192955589586481E-2,-5.8192955589586481E-2,null,null,null,2016,"",""]
[null,null,null,2017,null,null,"",null,null,null,2017,"",-4.6249460831498168E-2,null,null,null,2017,"",""]
[null,null,null,2018,null,null,"",null,0.52055466130660721,null,2018,"",-2.1290262063875964E-2,null,-0.25638777428586068,null,2018,"","",null,-0.51095988547024285]
[null,null,null,"Geometric Mean",null,null,"",null,0.11045383737459402,null,"Geometric Mean",-1.4731236625103672E-2,-2.242391246986486E-2,null,-7.1382999136301084E-2,null,"Geometric Mean","","",null,-0.16375001858772031]
[]
[]
[]
[]
[]
[]
[]
[]
[]
[]
[]
[]
[]
[]
[]
[]
[]
[]
[]
[]
[]
[]
[null,{"$f":"B434+1","v":8},"Customer Class:","Street Lighting",null,null,null,"Is the customer class billed on consumption (kWh) or demand (kW or kVA)?",null,null,null,null,null,"kW"]
[]
[null,null,null,"Calendar Year",null,"Customers",null,null,null,null,"Consumption (kWh) (3)",null,null,null,null,null,{"$f":"CONCATENATE(\"Consumption (kWh) per \",LEFT(F500,LEN(F500)-1))","v":"Consumption (kWh) per Customer"}]
[null,null,null,{"$f":"CONCATENATE(\"(for \",TestYear,\" Cost of Service\")","v":"(for 2018 Cost of Service"},null,null,null,null,null,null,null,"Actual (Weather actual)","Weather-normalized",null,"Weather-normalized",null,null,{"$f":"L501","v":"Actual (Weather actual)"},{"$f":"M501","v":"Weather-normalized"},null,{"$f":"O501","v":"Weather-normalized"}]
[null,null,"Historical",{"$f":"D503-1","v":2012},null,{"$f":"F438","v":"Actual"},4283,"",null,null,{"$f":"F502","v":"Actual"},3484987.18,3484987.18,"",null,null,{"$f":"K502","v":"Actual"},813.67900537006778,813.67900537006778,"",""]
[null,null,"Historical",2013,null,"Actual",4498,"Board-approved",4283,null,{"$f":"F503","v":"Actual"},2710401.7199999997,2710401.7199999997,"Board-approved",2144934,null,{"$f":"K503","v":"Actual"},602.57930635838147,602.57930635838147,"Board-approved",500.80177445715617]
[null,null,"Historical",2014,null,"Actual",4498,"",null,null,"Actual",2115841.9300000002,2115841.9300000002,"",null,null,"Actual",470.39616051578486,470.39616051578486,"",""]
[null,null,"Historical",2015,null,"Actual",4617.083333333333,"",null,null,"Actual",2025403.37,2025403.37,"",null,null,"Actual",438.67593971663212,438.67593971663212,"",""]
[null,null,"Historical",2016,null,"Actual",5927,"",null,null,"Actual",1938874.6199999999,1938874.6199999999,"",null,null,"Actual",327.12580057364602,327.12580057364602,"",""]
[null,null,"Bridge Year",2017,null,"Forecast",5998.0974893451794,"",null,null,"Forecast",null,1962132.4431208181,"",null,null,"Forecast",0,327.12580057364602,"",""]
[null,null,"Test Year",{"$f":"TestYear","v":2018},null,"Forecast",6070.0478305532215,"",null,null,"Forecast",null,1985669.2560900459,"",null,null,"Forecast",0,327.12580057364602,"",""]
[null,null,null,null,null,null,null,null,{"$f":"SUM(I502:I507)","v":4283},null,null,null,null,null,{"$f":"SUM(O502:O507)","v":2144934},null,null,null,null,null,{"$f":"SUM(U502:U507)","v":500.80177445715617}]
[null,null,"Variance Analysis","Year",null,null,"Year-over-year",null,"Test Year Versus Board-approved",null,"Year","Year-over-year",null,null,{"$f":"I510","v":"Test Year Versus Board-approved"},null,"Year","Year-over-year",null,null,{"$f":"O510","v":"Test Year Versus Board-approved"}]
[null,null,null,{"$f":"D502","v":2012},null,null,null,null,null,null,{"$f":"D511","v":2012},null,null,null,null,null,{"$f":"K511","v":2012}]
[null,null,null,2013,null,null,5.0198459024048514E-2,null,null,null,{"$f":"D512","v":2013},-0.22226350341983192,-0.22226350341983192,null,null,null,{"$f":"K512","v":2013},-0.25943854716477099,-0.25943854716477099]
[null,null,null,2014,null,null,0,null,null,null,2014,-0.21936223904108199,-0.21936223904108199,null,null,null,2014,-0.21936223904108187,-0.21936223904108187]
[null,null,null,2015,null,null,2.6474729509411432E-2,null,null,null,2015,-4.2743533303548853E-2,-4.2743533303548853E-2,null,null,null,2015,-6.7432992574539385E-2,-6.7432992574539385E-2]
[null,null,null,2016,null,null,0.28371085642090077,null,null,null,2016,-4.2721736954550504E-2,-4.2721736954550504E-2,null,null,null,2016,-0.2542882548220976,-0.2542882548220976]
[null,null,null,2017,null,null,1.1995527137705242E-2,null,null,null,2017,"",1.1995527137705464E-2,null,null,null,2017,"",0]
[null,null,null,2018,null,null,1.1995527137705242E-2,null,0.41724208044670119,null,2018,"",1.1995527137705242E-2,null,-7.4251582524196169E-2,null,2018,"",0,null,-0.34679584366841776]
[null,null,null,"Geometric Mean",null,null,7.2232107333489726E-2,null,9.109109107366975E-2,null,"Geometric Mean",-0.17753735835789974,-0.10640414547447008,null,-1.9103365215268009E-2,null,"Geometric Mean",-0.26194754469676529,-0.16660222314383633,null,-0.10099473562789596]
[]
[]
[null,null,null,"Calendar Year",null,"Revenues",null,null,null,null,{"$f":"IF(ISBLANK(N498),\"\",CONCATENATE(\"Demand (\",N498,\")\"))","v":"Demand (kW)"},null,null,null,null,null,{"$f":"CONCATENATE(\"Demand (\",N498,\") per \",LEFT(F500,LEN(F500)-1))","v":"Demand (kW) per Customer"}]
[null,null,null,{"$f":"CONCATENATE(\"(for \",TestYear,\" Cost of Service\")","v":"(for 2018 Cost of Service"},null,null,null,null,null,null,null,"Actual (Weather actual)","Weather-normalized",null,{"$f":"M522","v":"Weather-normalized"},null,null,{"$f":"L522","v":"Actual (Weather actual)"},{"$f":"M522","v":"Weather-normalized"},null,{"$f":"O522","v":"Weather-normalized"}]
[null,null,"Historical",{"$f":"D524-1","v":2012},null,{"$f":"F502","v":"Actual"},null,"",null,null,{"$f":"K502","v":"Actual"},9969.1499999999978,9969.1499999999978,"",null,null,{"$f":"K523","v":"Actual"},"","","",""]
[null,null,"Historical",2013,null,"Actual",null,"Board-approved",344523.30094205448,null,"Actual",7517.93,7517.93,"Board-approved",6753.5,null,{"$f":"K524","v":"Actual"},"","","Board-approved",1.9602447734401205E-2]
[null,null,"Historical",2014,null,"Actual",null,"",null,null,"Actual",5900.04,5900.04,"",null,null,"Actual","","","",""]
[null,null,"Historical",2015,null,"Actual",null,"",null,null,"Actual",5564.23,5564.23,"",null,null,"Actual","","","",""]
[null,null,"Historical",2016,null,"Actual",null,"",null,null,"Actual",5228.83,5228.83,"",null,null,"Actual","","","",""]
[null,null,"Bridge Year (Forecast)",2017,null,"Forecast",null,"",null,null,"Forecast",null,5384.4611321252642,"",null,null,"Forecast","","","",""]
[null,null,"Test Year (Forecast)",{"$f":"TestYear","v":2018},null,"Forecast",287341.63,"",null,null,"Forecast",null,5449.0505817575922,"",null,null,"Forecast",0,1.8963665591225302E-2,"",""]
[null,null,null,null,null,null,null,null,{"$f":"SUM(I523:I528)","v":344523.30094205448},null,null,null,null,null,{"$f":"SUM(O523:O528)","v":6753.5},null,null,null,null,null,{"$f":"SUM(U523:U528)","v":1.9602447734401205E-2}]
[null,null,"Variance Analysis","Year",null,null,"Year-over-year",null,{"$f":"I510","v":"Test Year Versus Board-approved"},null,"Year","Year-over-year",null,null,{"$f":"I531","v":"Test Year Versus Board-approved"},null,"Year","Year-over-year",null,null,{"$f":"O531","v":"Test Year Versus Board-approved"}]
[null,null,null,{"$f":"D523","v":2012},null,null,null,null,null,null,{"$f":"D532","v":2012},null,null,null,null,null,{"$f":"K532","v":2012}]
[null,null,null,2013,null,null,"",null,null,null,{"$f":"D533","v":2013},-0.24588054147043614,-0.24588054147043614,null,null,null,{"$f":"K533","v":2013},"",""]
[null,null,null,2014,null,null,"",null,null,null,2014,-0.21520418519459483,-0.21520418519459483,null,null,null,2014,"",""]
[null,null,null,2015,null,null,"",null,null,null,2015,-5.6916563277537136E-2,-5.6916563277537136E-2,null,null,null,2015,"",""]
[null,null,null,2016,null,null,"",null,null,null,2016,-6.0277882114865733E-2,-6.0277882114865733E-2,null,null,null,2016,"",""]
[null,null,null,2017,null,null,"",null,null,null,2017,"",2.9764045135386663E-2,null,null,null,2017,"",""]
[null,null,null,2018,null,null,"",null,-0.16597330510214714,null,2018,"",1.1995527137705242E-2,null,-0.19315161297733141,null,2018,"","",null,-3.258685608200218E-2]
[null,null,null,"Geometric Mean",null,null,"",null,-4.435852958225539E-2,null,"Geometric Mean",-0.19354130159252814,-0.11379837562415751,null,-5.2240854727155117E-2,null,"Geometric Mean","","",null,-8.2482033156787704E-3]
[]
[]
[]
[]
[]
[]
[]
[]
[]
[]
[]
[]
[]
[]
[]
[]
[]
[]
[]
[]
[]
[]
[null,{"$f":"B498+1","v":9},"Customer Class:","Embedded Distributor",null,null,null,"Is the customer class billed on consumption (kWh) or demand (kW or kVA)?",null,null,null,null,null,"kW"]
[]
[null,null,null,"Calendar Year",null,"Customers",null,null,null,null,"Consumption (kWh) (3)",null,null,null,null,null,{"$f":"CONCATENATE(\"Consumption (kWh) per \",LEFT(F564,LEN(F564)-1))","v":"Consumption (kWh) per Customer"}]
[null,null,null,{"$f":"CONCATENATE(\"(for \",TestYear,\" Cost of Service\")","v":"(for 2018 Cost of Service"},null,null,null,null,null,null,null,"Actual (Weather actual)","Weather-normalized",null,"Weather-normalized",null,null,{"$f":"L565","v":"Actual (Weather actual)"},{"$f":"M565","v":"Weather-normalized"},null,{"$f":"O565","v":"Weather-normalized"}]
[null,null,"Historical",{"$f":"D567-1","v":2012},null,{"$f":"F502","v":"Actual"},3,"",null,null,{"$f":"F566","v":"Actual"},15488406.9,15488406.9,"",null,null,{"$f":"K566","v":"Actual"},5162802.3,5162802.3,"",""]
[null,null,"Historical",2013,null,"Actual",4,"Board-approved",3,null,{"$f":"F567","v":"Actual"},15613194.549999999,15613194.549999999,"Board-approved",17350000,null,{"$f":"K567","v":"Actual"},3903298.6374999997,3903298.6374999997,"Board-approved",5783333.333333333]
[null,null,"Historical",2014,null,"Actual",4,"",null,null,"Actual",16830475.099999998,16830475.099999998,"",null,null,"Actual",4207618.7749999994,4207618.7749999994,"",""]
[null,null,"Historical",2015,null,"Actual",4,"",null,null,"Actual",16494364,16494364,"",null,null,"Actual",4123591,4123591,"",""]
[null,null,"Historical",2016,null,"Actual",4,"",null,null,"Actual",16248812.099999998,16248812.099999998,"",null,null,"Actual",4062203.0249999994,4062203.0249999994,"",""]
[null,null,"Bridge Year",2017,null,"Forecast",4,"",null,null,"Forecast",null,16296711.4375,"",null,null,"Forecast",0,4074177.859375,"",""]
[null,null,"Test Year",{"$f":"TestYear","v":2018},null,"Forecast",4,"",null,null,"Forecast",null,16296711.4375,"",null,null,"Forecast",0,4074177.859375,"",""]
[null,null,null,null,null,null,null,null,{"$f":"SUM(I566:I571)","v":3},null,null,null,null,null,{"$f":"SUM(O566:O571)","v":17350000},null,null,null,null,null,{"$f":"SUM(U566:U571)","v":5783333.333333333}]
[null,null,"Variance Analysis","Year",null,null,"Year-over-year",null,"Test Year Versus Board-approved",null,"Year","Year-over-year",null,null,{"$f":"I574","v":"Test Year Versus Board-approved"},null,"Year","Year-over-year",null,null,{"$f":"O574","v":"Test Year Versus Board-approved"}]
[null,null,null,{"$f":"D566","v":2012},null,null,null,null,null,null,{"$f":"D575","v":2012},null,null,null,null,null,{"$f":"K575","v":2012}]
[null,null,null,2013,null,null,0.33333333333333326,null,null,null,{"$f":"D576","v":2013},8.0568421791655798E-3,8.0568421791655798E-3,null,null,null,{"$f":"K576","v":2013},-0.24395736836562576,-0.24395736836562576]
[null,null,null,2014,null,null,0,null,null,null,2014,7.7964861457516355E-2,7.7964861457516355E-2,null,null,null,2014,7.7964861457516355E-2,7.7964861457516355E-2]
[null,null,null,2015,null,null,0,null,null,null,2015,-1.9970386932214312E-2,-1.9970386932214312E-2,null,null,null,2015,-1.9970386932214312E-2,-1.9970386932214312E-2]
[null,null,null,2016,null,null,0,null,null,null,2016,-1.4887018377913952E-2,-1.4887018377913952E-2,null,null,null,2016,-1.4887018377913952E-2,-1.4887018377913952E-2]
[null,null,null,2017,null,null,0,null,null,null,2017,"",2.9478670320768341E-3,null,null,null,2017,"",2.9478670320768341E-3]
[null,null,null,2018,null,null,0,null,0.33333333333333326,null,2018,"",0,null,-6.0708274495677284E-2,null,2018,"",0,null,-0.29553120587175785]
[null,null,null,"Geometric Mean",null,null,5.9223841048812176E-2,null,7.4569931823541991E-2,null,"Geometric Mean",1.6104299431177527E-2,1.022624084277135E-2,null,-1.5535354636545984E-2,null,"Geometric Mean",-7.6807976519166377E-2,-4.6258022437943636E-2,null,-8.3852417410544389E-2]
[]
[]
[null,null,null,"Calendar Year",null,"Revenues",null,null,null,null,{"$f":"IF(ISBLANK(N562),\"\",CONCATENATE(\"Demand (\",N562,\")\"))","v":"Demand (kW)"},null,null,null,null,null,{"$f":"CONCATENATE(\"Demand (\",N562,\") per \",LEFT(F564,LEN(F564)-1))","v":"Demand (kW) per Customer"}]
[null,null,null,{"$f":"CONCATENATE(\"(for \",TestYear,\" Cost of Service\")","v":"(for 2018 Cost of Service"},null,null,null,null,null,null,null,"Actual (Weather actual)","Weather-normalized",null,{"$f":"M586","v":"Weather-normalized"},null,null,{"$f":"L586","v":"Actual (Weather actual)"},{"$f":"M586","v":"Weather-normalized"},null,{"$f":"O586","v":"Weather-normalized"}]
[null,null,"Historical",{"$f":"D588-1","v":2012},null,{"$f":"F566","v":"Actual"},null,"",null,null,{"$f":"K566","v":"Actual"},36021.499999999993,36021.499999999993,"",null,null,{"$f":"K587","v":"Actual"},"","","",""]
[null,null,"Historical",2013,null,"Actual",null,"Board-approved",170675.79845093202,null,"Actual",36253.199999999997,36253.199999999997,"Board-approved",39284,null,{"$f":"K588","v":"Actual"},"","","Board-approved",0.23016737203836107]
[null,null,"Historical",2014,null,"Actual",null,"",null,null,"Actual",36008.5,36008.5,"",null,null,"Actual","","","",""]
[null,null,"Historical",2015,null,"Actual",null,"",null,null,"Actual",35856,35856,"",null,null,"Actual","","","",""]
[null,null,"Historical",2016,null,"Actual",null,"",null,null,"Actual",36389.200000000004,36389.200000000004,"",null,null,"Actual","","","",""]
[null,null,"Bridge Year (Forecast)",2017,null,"Forecast",null,"",null,null,"Forecast",null,34856.398296673804,"",null,null,"Forecast","","","",""]
[null,null,"Test Year (Forecast)",{"$f":"TestYear","v":2018},null,"Forecast",131369.25,"",null,null,"Forecast",null,34856.398296673804,"",null,null,"Forecast",0,0.26533148584371002,"",""]
[null,null,null,null,null,null,null,null,{"$f":"SUM(I587:I592)","v":170675.79845093202},null,null,null,null,null,{"$f":"SUM(O587:O592)","v":39284},null,null,null,null,null,{"$f":"SUM(U587:U592)","v":0.23016737203836107}]
[null,null,"Variance Analysis","Year",null,null,"Year-over-year",null,{"$f":"I574","v":"Test Year Versus Board-approved"},null,"Year","Year-over-year",null,null,{"$f":"I595","v":"Test Year Versus Board-approved"},null,"Year","Year-over-year",null,null,{"$f":"O595","v":"Test Year Versus Board-approved"}]
[null,null,null,{"$f":"D587","v":2012},null,null,null,null,null,null,{"$f":"D596","v":2012},null,null,null,null,null,{"$f":"K596","v":2012}]
[null,null,null,2013,null,null,"",null,null,null,{"$f":"D597","v":2013},6.4322696167566917E-3,6.4322696167566917E-3,null,null,null,{"$f":"K597","v":2013},"",""]
[null,null,null,2014,null,null,"",null,null,null,2014,-6.7497489876754413E-3,-6.7497489876754413E-3,null,null,null,2014,"",""]
[null,null,null,2015,null,null,"",null,null,null,2015,-4.2351111543107445E-3,-4.2351111543107445E-3,null,null,null,2015,"",""]
[null,null,null,2016,null,null,"",null,null,null,2016,1.4870593485051486E-2,1.4870593485051486E-2,null,null,null,2016,"",""]
[null,null,null,2017,null,null,"",null,null,null,2017,"",-4.2122434769827355E-2,null,null,null,2017,"",""]
[null,null,null,2018,null,null,"",null,-0.23029948479914308,null,2018,"",0,null,-0.11270750695769771,null,2018,"","",null,0.15277627534231164]
[null,null,null,"Geometric Mean",null,null,"",null,-6.3343299366687589E-2,null,"Geometric Mean",3.3910850663021463E-3,-6.5542797393043362E-3,null,-2.9452708841778863E-2,null,"Geometric Mean","","",null,3.6182510093606179E-2]
[]
[]
[]
[]
[]
[]
[]
[]
[]
[]
[]
[]
[]
[]
[]
[]
[]
[]
[]
[]
[]
[null,{"$f":"B562+1","v":10},"Customer Class:",null,null,null,null,"Is the customer class billed on consumption (kWh) or demand (kW or kVA)?"]
[]
[null,null,null,"Calendar Year",null,"Customers",null,null,null,null,"Consumption (kWh) (3)",null,null,null,null,null,{"$f":"CONCATENATE(\"Consumption (kWh) per \",LEFT(F627,LEN(F627)-1))","v":"Consumption (kWh) per Customer"}]
[null,null,null,{"$f":"CONCATENATE(\"(for \",TestYear,\" Cost of Service\")","v":"(for 2018 Cost of Service"},null,null,null,null,null,null,null,"Actual (Weather actual)","Weather-normalized",null,"Weather-normalized",null,null,{"$f":"L628","v":"Actual (Weather actual)"},{"$f":"M628","v":"Weather-normalized"},null,{"$f":"O628","v":"Weather-normalized"}]
[null,null,"Historical",{"$f":"D630-1","v":2012},null,{"$f":"F566","v":"Actual"},null,{"$f":"IF(D629=RebaseYear,\"Board-approved\",\"\")","v":"Board-approved"},null,null,{"$f":"F629","v":"Actual"},null,null,{"$f":"H629","v":"Board-approved"},null,null,{"$f":"K629","v":"Actual"},{"$f":"IF(G629=0,\"\",L629/G629)","v":""},{"$f":"IF(G629=0,\"\",M629/G629)","v":""},{"$f":"N629","v":"Board-approved"},{"$f":"IF(T629=\"\",\"\",IF(I629=0,\"\",O629/I629))","v":""}]
[null,null,"Historical",2013,null,"Actual",null,"",null,null,{"$f":"F630","v":"Actual"},null,null,{"$f":"H630","v":""},null,null,{"$f":"K630","v":"Actual"},{"$f":"IF(G630=0,\"\",L630/G630)","v":""},{"$f":"IF(G630=0,\"\",M630/G630)","v":""},{"$f":"N630","v":""},{"$f":"IF(T630=\"\",\"\",IF(I630=0,\"\",O630/I630))","v":""}]
[null,null,"Historical",2014,null,"Actual",null,"",null,null,"Actual",null,null,"",null,null,"Actual","","","",""]
[null,null,"Historical",2015,null,"Actual",null,"",null,null,"Actual",null,null,"",null,null,"Actual","","","",""]
[null,null,"Historical",2016,null,"Actual",null,"",null,null,"Actual",null,null,"",null,null,"Actual","","","",""]
[null,null,"Bridge Year",2017,null,"Forecast",null,"",null,null,"Forecast",null,null,"",null,null,"Forecast","","","",""]
[null,null,"Test Year",{"$f":"TestYear","v":2018},null,"Forecast",null,"",null,null,"Forecast",null,null,"",null,null,"Forecast","","","",""]
[null,null,null,null,null,null,null,null,{"$f":"SUM(I629:I634)","v":0},null,null,null,null,null,{"$f":"SUM(O629:O634)","v":0},null,null,null,null,null,{"$f":"SUM(U629:U634)","v":0}]
[null,null,"Variance Analysis","Year",null,null,"Year-over-year",null,"Test Year Versus Board-approved",null,"Year","Year-over-year",null,null,{"$f":"I637","v":"Test Year Versus Board-approved"},null,"Year","Year-over-year",null,null,{"$f":"O637","v":"Test Year Versus Board-approved"}]
[null,null,null,{"$f":"D629","v":2012},null,null,null,null,null,null,{"$f":"D638","v":2012},null,null,null,null,null,{"$f":"K638","v":2012}]
[null,null,null,2013,null,null,{"$f":"IF(G629=0,\"\",G630/G629-1)","v":""},null,null,null,{"$f":"D639","v":2013},{"$f":"IF(L629=0,\"\",L630/L629-1)","v":""},"",null,null,null,{"$f":"K639","v":2013},{"$f":"IF(R629=\"\",\"\",IF(R629=0,\"\",R630/R629-1))","v":""},""]
[null,null,null,2014,null,null,"",null,null,null,2014,"","",null,null,null,2014,"",""]
[null,null,null,2015,null,null,"",null,null,null,2015,"","",null,null,null,2015,"",""]
[null,null,null,2016,null,null,"",null,null,null,2016,"","",null,null,null,2016,"",""]
[null,null,null,2017,null,null,"",null,null,null,2017,{"$f":"IF(K634=\"Forecast\",\"\",IF(L633=0,\"\",L634/L633-1))","v":""},{"$f":"IF(M633=0,\"\",M634/M633-1)","v":""},null,null,null,2017,{"$f":"IF(Q634=\"Forecast\",\"\",IF(R633=0,\"\",R634/R633-1))","v":""},{"$f":"IF(S633=\"\",\"\",IF(S633=0,\"\",S634/S633-1))","v":""}]
[null,null,null,2018,null,null,"",null,{"$f":"IF(I636=0,\"\",G635/I636-1)","v":""},null,2018,{"$f":"IF(K635=\"Forecast\",\"\",IF(L634=0,\"\",L635/L634-1))","v":""},{"$f":"IF(M634=0,\"\",M635/M634-1)","v":""},null,{"$f":"IF(O636=0,\"\",M635/O636-1)","v":""},null,2018,{"$f":"IF(Q635=\"Forecast\",\"\",IF(R634=0,\"\",R635/R634-1))","v":""},{"$f":"IF(S634=\"\",\"\",IF(S634=0,\"\",S635/S634-1))","v":""},null,{"$f":"IF(U636=0,\"\",S635/U636-1)","v":""}]
[null,null,null,"Geometric Mean",null,null,{"$f":"IF(G629=0,\"\",(G635/G629)^(1/($D635-$D629-1))-1)","v":""},null,{"$f":"IF(I636=0,\"\",(G635/I636)^(1/(TestYear-RebaseYear-1))-1)","v":""},null,"Geometric Mean",{"$f":"IF(L629=0,\"\",(L633/L629)^(1/($D633-$D629-1))-1)","v":""},{"$f":"IF(M629=0,\"\",(M635/M629)^(1/($D635-$D629-1))-1)","v":""},null,{"$f":"IF(O636=0,\"\",(M635/O636)^(1/(TestYear-RebaseYear-1))-1)","v":""},null,"Geometric Mean",{"$f":"IF(R629=\"\",\"\",IF(R629=0,\"\",(R633/R629)^(1/($D633-$D629-1))-1))","v":""},{"$f":"IF(S629=\"\",\"\",IF(S629=0,\"\",(S635/S629)^(1/($D635-$D629-1))-1))","v":""},null,{"$f":"IF(U636=0,\"\",(S635/U636)^(1/(TestYear-RebaseYear-1))-1)","v":""}]
[]
[]
[null,null,null,"Calendar Year",null,"Revenues",null,null,null,null,{"$f":"IF(ISBLANK(N625),\"\",CONCATENATE(\"Demand (\",N625,\")\"))","v":""},null,null,null,null,null,{"$f":"CONCATENATE(\"Demand (\",N625,\") per \",LEFT(F627,LEN(F627)-1))","v":"Demand () per Customer"}]
[null,null,null,{"$f":"CONCATENATE(\"(for \",TestYear,\" Cost of Service\")","v":"(for 2018 Cost of Service"},null,null,null,null,null,null,null,"Actual (Weather actual)","Weather-normalized",null,{"$f":"M649","v":"Weather-normalized"},null,null,{"$f":"L649","v":"Actual (Weather actual)"},{"$f":"M649","v":"Weather-normalized"},null,{"$f":"O649","v":"Weather-normalized"}]
[null,null,"Historical",{"$f":"D651-1","v":2012},null,{"$f":"F629","v":"Actual"},null,{"$f":"IF(D650=RebaseYear,\"Board-approved\",\"\")","v":"Board-approved"},null,null,{"$f":"K629","v":"Actual"},null,null,{"$f":"N629","v":"Board-approved"},null,null,{"$f":"K650","v":"Actual"},{"$f":"IF(G650=0,\"\",L650/G650)","v":""},{"$f":"IF(G650=0,\"\",M650/G650)","v":""},{"$f":"N650","v":"Board-approved"},{"$f":"IF(T650=\"\",\"\",IF(I650=0,\"\",O650/I650))","v":""}]
[null,null,"Historical",2013,null,"Actual",null,"",null,null,"Actual",null,null,"",null,null,{"$f":"K651","v":"Actual"},{"$f":"IF(G651=0,\"\",L651/G651)","v":""},{"$f":"IF(G651=0,\"\",M651/G651)","v":""},{"$f":"N651","v":""},{"$f":"IF(T651=\"\",\"\",IF(I651=0,\"\",O651/I651))","v":""}]
[null,null,"Historical",2014,null,"Actual",null,"",null,null,"Actual",null,null,"",null,null,"Actual","","","",""]
[null,null,"Historical",2015,null,"Actual",null,"",null,null,"Actual",null,null,"",null,null,"Actual","","","",""]
[null,null,"Historical",2016,null,"Actual",null,"",null,null,"Actual",null,null,"",null,null,"Actual","","","",""]
[null,null,"Bridge Year (Forecast)",2017,null,"Forecast",null,"",null,null,"Forecast",null,null,"",null,null,"Forecast","","","",""]
[null,null,"Test Year (Forecast)",{"$f":"TestYear","v":2018},null,"Forecast",null,"",null,null,"Forecast",null,null,"",null,null,"Forecast","","","",""]
[null,null,null,null,null,null,null,null,{"$f":"SUM(I650:I655)","v":0},null,null,null,null,null,{"$f":"SUM(O650:O655)","v":0},null,null,null,null,null,{"$f":"SUM(U650:U655)","v":0}]
[null,null,"Variance Analysis","Year",null,null,"Year-over-year",null,{"$f":"I637","v":"Test Year Versus Board-approved"},null,"Year","Year-over-year",null,null,{"$f":"I658","v":"Test Year Versus Board-approved"},null,"Year","Year-over-year",null,null,{"$f":"O658","v":"Test Year Versus Board-approved"}]
[null,null,null,{"$f":"D650","v":2012},null,null,null,null,null,null,{"$f":"D659","v":2012},null,null,null,null,null,{"$f":"K659","v":2012}]
[null,null,null,2013,null,null,{"$f":"IF(G650=0,\"\",G651/G650-1)","v":""},null,null,null,{"$f":"D660","v":2013},{"$f":"IF(L650=0,\"\",L651/L650-1)","v":""},"",null,null,null,{"$f":"K660","v":2013},{"$f":"IF(R650=\"\",\"\",IF(R650=0,\"\",R651/R650-1))","v":""},""]
[null,null,null,2014,null,null,"",null,null,null,2014,"","",null,null,null,2014,"",""]
[null,null,null,2015,null,null,"",null,null,null,2015,"","",null,null,null,2015,"",""]
[null,null,null,2016,null,null,"",null,null,null,2016,"","",null,null,null,2016,"",""]
[null,null,null,2017,null,null,"",null,null,null,2017,{"$f":"IF(K655=\"Forecast\",\"\",IF(L654=0,\"\",L655/L654-1))","v":""},{"$f":"IF(M654=0,\"\",M655/M654-1)","v":""},null,null,null,2017,{"$f":"IF(Q655=\"Forecast\",\"\",IF(R654=0,\"\",R655/R654-1))","v":""},{"$f":"IF(S654=\"\",\"\",IF(S654=0,\"\",S655/S654-1))","v":""}]
[null,null,null,2018,null,null,"",null,{"$f":"IF(I657=0,\"\",G656/I657-1)","v":""},null,2018,{"$f":"IF(K656=\"Forecast\",\"\",IF(L655=0,\"\",L656/L655-1))","v":""},{"$f":"IF(M655=0,\"\",M656/M655-1)","v":""},null,{"$f":"IF(O657=0,\"\",M656/O657-1)","v":""},null,2018,{"$f":"IF(Q656=\"Forecast\",\"\",IF(R655=0,\"\",R656/R655-1))","v":""},{"$f":"IF(S655=\"\",\"\",IF(S655=0,\"\",S656/S655-1))","v":""},null,{"$f":"IF(U657=0,\"\",S656/U657-1)","v":""}]
[null,null,null,"Geometric Mean",null,null,{"$f":"IF(G650=0,\"\",(G656/G650)^(1/($D656-$D650-1))-1)","v":""},null,{"$f":"IF(I657=0,\"\",(G656/I657)^(1/(TestYear-RebaseYear-1))-1)","v":""},null,"Geometric Mean",{"$f":"IF(L650=0,\"\",(L654/L650)^(1/($D654-$D650-1))-1)","v":""},{"$f":"IF(M650=0,\"\",(M656/M650)^(1/($D656-$D650-1))-1)","v":""},null,{"$f":"IF(O657=0,\"\",(M656/O657)^(1/(TestYear-RebaseYear-1))-1)","v":""},null,"Geometric Mean",{"$f":"IF(R650=\"\",\"\",IF(R650=0,\"\",(R654/R650)^(1/($D654-$D650-1))-1))","v":""},{"$f":"IF(S650=\"\",\"\",IF(S650=0,\"\",(S656/S650)^(1/($D656-$D650-1))-1))","v":""},null,{"$f":"IF(U657=0,\"\",(S656/U657)^(1/(TestYear-RebaseYear-1))-1)","v":""}]
[]
[null,"Note: If there are more than ten (10) customer classes, please contact OEB Staff to add tables for additional customer classes."]

{"sheet":"App.2-JA_OM&A_Summary_Analys","index":24,"n_rows":60,"n_cols":16,"rows_kept":60,"cut":false,"hidden":false,"merged":[[62,1,63,5],[57,0,58,11],[8,0,8,6],[9,0,9,6],[12,9,12,10],[59,0,59,11]]}
[null,null,null,null,null,null,null,null,null,null,"File Number:",{"$f":"EBNUMBER","v":"EB-2017-0038"}]
[null,null,null,null,null,null,null,null,null,null,"Exhibit:",4]
[null,null,null,null,null,null,null,null,null,null,"Tab:",2]
[null,null,null,null,null,null,null,null,null,null,"Schedule:"]
[null,null,null,null,null,null,null,null,null,null,"Page:",13]
[]
[null,null,null,null,null,null,null,null,null,null,"Date:","Sept 12, 2017"]
[]
["Appendix 2-JA"]
["Summary of Recoverable OM&A Expenses"]
[]
[]
[null,{"$f":"\"Last Rebasing Year (\" & RebaseYear & \" Board-Approved)\"","v":"Last Rebasing Year (2012 Board-Approved)"},{"$f":"\"Last Rebasing Year (\" & RebaseYear & \" Actuals)\"","v":"Last Rebasing Year (2012 Actuals)"},{"$f":"BridgeYear -4 & \" Actuals\"","v":"2013 Actuals"},{"$f":"BridgeYear -3 & \" Actuals\"","v":"2014 Actuals"},{"$f":"BridgeYear -2 & \" Actuals\"","v":"2015 Actuals"},{"$f":"BridgeYear -1 & \" Actuals\"","v":"2016 Actuals"},{"$f":"BridgeYear & \" Bridge Year\"","v":"2017 Bridge Year"},{"$f":"TestYear & \" Test Year\"","v":"2018 Test Year"}]
["Reporting Basis"]
["Operations",{"$f":"'[15]4-5 Summ Recvrble OM&A '!$C$6","v":187550.94169694325},{"$f":"'[15]4-5 Summ Recvrble OM&A '!$D$6","v":160299.49},100096.19999999998,110017.7,{"$f":"'[15]4-5 Summ Recvrble OM&A '!$G$6","v":128569.22},{"$f":"'[15]4-5 Summ Recvrble OM&A '!$H$6","v":91573.77},{"$f":"'[15]4-5 Summ Recvrble OM&A '!$I$6","v":93130.524090000006},{"$f":"'[15]4-5 Summ Recvrble OM&A '!$J$6","v":116388.74299953}]
["Maintenance",{"$f":"'[15]4-5 Summ Recvrble OM&A '!$C$7","v":696404.6840483367},{"$f":"'[15]4-5 Summ Recvrble OM&A '!$D$7","v":595215.97},645160.6,578159.40999999992,{"$f":"'[15]4-5 Summ Recvrble OM&A '!$G$7","v":320159.94999999995},{"$f":"'[15]4-5 Summ Recvrble OM&A '!$H$7","v":286801.81},363401,368360]
["SubTotal",{"$f":"SUM(B15:B16)","v":883955.62574527995},755515.46,745256.79999999993,688177.10999999987,448729.16999999993,378375.58,456531.52409000002,484748.74299952999]
["%Change (year over year)",null,null,null,null,{"$f":"IF(ISERROR((F17-C17)/C17), \"\", (F17-C17)/C17)","v":-0.40606222670810743},{"$f":"IF(ISERROR((G17-F17)/F17), \"\", (G17-F17)/F17)","v":-0.15678407980475154},{"$f":"IF(ISERROR((H17-G17)/G17), \"\", (H17-G17)/G17)","v":0.20655652272802594},{"$f":"IF(ISERROR((I17-H17)/H17), \"\", (I17-H17)/H17)","v":6.1807821411183128E-2}]
["%Change (Test Year vs \nLast Rebasing Year - Actual)",null,null,null,null,null,null,null,{"$f":"IF(ISERROR((I17-C17)/C17), \"\", (I17-C17)/C17)","v":-0.35838673241771912}]
["Billing and Collecting",987418.0048516728,843945,1172874.1100000001,1259465.01,1123052,993572,1010498.0803599998,1052713.7767261197]
["Community Relations",null,18711,22086,22871,21168,24584,24584,24953]
["Administrative and General",3789220.4264030466,3236967,{"$f":"3682598.24-D21","v":3660512.24},{"$f":"3655306.52-E21","v":3632435.52},4199274,4595970,4690294.002700001,4894353.8791596098]
["SubTotal",{"$f":"SUM(B20:B22)","v":4776638.4312547194},4099623,4855472.3500000006,4914771.53,5343494,5614126,5725376.083060001,5972020.6558857299]
["%Change (year over year)",null,null,null,null,{"$f":"IF(ISERROR((F23-C23)/C23), \"\", (F23-C23)/C23)","v":0.30341106974958432},{"$f":"IF(ISERROR((G23-F23)/F23), \"\", (G23-F23)/F23)","v":5.0647011112953437E-2},1.9816121946307542E-2,4.307919152341632E-2]
["%Change (Test Year vs \nLast Rebasing Year - Actual)",null,null,null,null,null,null,null,0.45672449358770989]
["Total",{"$f":"SUM(B23,B17)","v":5660594.0569999991},4855138.46,5600729.1500000004,5602948.6400000006,5792223.1699999999,5992501.5800000001,6181908.0479200007,6456769.3561483501]
["%Change (year over year)",null,null,null,null,{"$f":"IF(ISERROR((F26-C26)/C26), \"\", (F26-C26)/C26)","v":0.19300885396376521},{"$f":"IF(ISERROR((G26-F26)/F26), \"\", (G26-F26)/F26)","v":3.4577122483352131E-2},3.1607266044788043E-2,4.4462212329546162E-2]
[]
[]
[null,{"$f":"B13","v":"Last Rebasing Year (2012 Board-Approved)"},"Last Rebasing Year (2012 Actuals)","2013 Actuals","2014 Actuals","2015 Actuals","2016 Actuals","2017 Bridge Year","2018 Test Year"]
["Operations",187550.94169694299,160299.49,100096.19999999998,110017.7,128569.22,91573.77,93130.524090000006,116388.74299953]
["Maintenance",696404.6840483367,595215.97,645160.6,578159.40999999992,320159.94999999995,286801.80999999994,363401.44076999999,368359.95726309001]
["Billing and Collecting",987418.0048516728,843944.59000000008,1172874.1100000001,1259465.01,1123051.5499999998,993572.08,1010498.0803599998,1052713.7767261197]
["Community Relations",0,18711,22086,22871,21168,24584,24584,24953]
["Administrative and General",3789220.3645049362,3236967.01,3682598.2399999998,3655306.52,4199274.3,4595969.8,4690294.002700001,4894353.8791596098]
["Total",5660593.9951018887,4855138.0599999996,5622815.1500000004,5625819.6399999997,5792223.0199999996,5992501.46,6181908.0479200007,6456769.3561483491]
["%Change (year over year)",null,null,null,null,0.193008921357017,3.4577128558147339E-2,3.1607266044788043E-2,4.4462212329546016E-2]
[]
[]
[null,"Last Rebasing Year (2012 Board-Approved)","Last Rebasing Year (2012 Actuals)","Variance 2012  Board-approved – 2012 Actuals","2013 Actuals","Variance 2013 Actuals vs. 2012 Actuals","2014 Actuals","Variance 2014 Actuals vs. 2013 Actuals","2015 Actuals","Variance 2015 Actuals vs. 2014 Actuals","2016 Actuals","Variance 2016 Actuals vs. 2015 Actuals","2017 Bridge Year","Variance 2017 Bridge vs. 2016 Actuals","2018 Test Year","Variance 2018 Test vs. 2017 Bridge"]
["Operations",187550.94169694322,160299.49,27251.45169694323,100096.19999999998,-60203.290000000008,110017.7,9921.5000000000146,128569.22,18551.520000000004,91573.77,-36995.449999999997,93130.524090000006,1556.7540900000022,116388.74299953,23258.218909529998]
["Maintenance ",696404.6840483367,595215.97,101188.71404833673,645160.6,49944.630000000005,578159.40999999992,-67001.190000000061,320159.94999999995,-257999.45999999996,286801.80999999994,-33358.140000000014,363401.44076999999,76599.630770000047,368359.95726309001,4958.516493090021]
["Billing and Collecting ",987418.0048516728,843944.59000000008,143473.41485167271,1172874.1100000001,328929.52,1259465.01,86590.899999999907,1123051.5499999998,-136413.4600000002,993572.08,-129479.46999999986,1010498.0803599998,16926.000359999831,1052713.7767261197,42215.696366119897]
["Community Relations ",0,18711,-18711,22086,3375,22871,785,21168,-1703,24584,3416,24584,0,24953,369]
["Administrative and General ",3789220.3645049362,3236967.01,552253.35450493637,3682598.2399999998,445631.23,3655306.52,-27291.719999999739,4199274.3,543967.7799999998,4595969.8,396695.5,4690294.002700001,94324.202700001188,4894353.8791596098,204059.87645960879]
["Total OM&A Expenses ",5660593.9951018887,4855138.0599999996,805455.93510188907,5622815.1500000004,767677.09000000078,5625819.6399999997,3004.4899999992922,5792223.0199999996,166403.37999999989,5992501.46,200278.44000000041,6181908.0479200007,189406.58792000078,6456769.3561483491,274861.30822834838]
["Adjustments for Total non-recoverable items (from Appendices 2-JA and 2-JB)"]
["Total Recoverable OM&A Expenses ",5660593.9951018887,4855138.0599999996,805455.93510188907,5600729.1500000004,767677.09000000078,5602948.6399999997,3004.4899999992922,5792223.0199999996,166403.37999999989,5992501.46,200278.44000000041,6181908.0479200007,189406.58792000078,6456769.3561483491,274861.30822834838]
["Variance from previous year ",null,null,null,745591.09000000078,null,2219.4899999992922,null,189274.37999999989,null,200278.44000000041,null,189406.58792000078,null,274861.30822834838]
["Percent change (year over year) ",null,null,null,0.15356743326059008,null,3.9628590145254425E-4,null,3.3781209174175097E-2,null,3.4577128558147339E-2,null,3.1607266044788043E-2,null,4.4462212329546016E-2]
["Percent Change:                                                    Test year vs. Most Current Actual ",null,null,null,null,null,null,null,null,null,7.7474807348373878E-2]
["Simple average of % variance for all years",null,null,null,null,null,null,null,null,null,0.32988378010168257,null,null,null,null,3.6106954026664126E-2]
["Compound Annual Growth Rate for all years",null,null,null,null,null,null,null,null,null,"",null,null,null,null,5.8675195626579857E-2]
[{"$f":"\"Compound Growth Rate                                                            (\" & G13 & \" vs. \" & 'LDC Info'!E28 & \" Actuals)\"","v":"Compound Growth Rate                                                            (2016 Actuals vs. 2012 Actuals)"},null,null,null,null,null,null,null,null,null,7.2676718764562276E-2]
[]
["Note:"]
[]
["1     If it has been more than three years since the applicant last filed a cost of service application, additional years of historical actuals should be incorporated into the table, as necessary, to go back to the last cost of service application.  If the applicant last filed a cost of service application less than three years ago, a minimum of three years of actual information is required."]
[]
["2     Recoverable OM&A that is included on these tables should be identical to the recoverable OM&A that is shown for the corresponding periods on Appendix 2-JB."]

{"sheet":"App.2-JB_OM&A_Cost _Drivers","index":25,"n_rows":54,"n_cols":8,"rows_kept":54,"cut":false,"hidden":false,"merged":[[9,0,9,6],[10,0,10,6],[56,1,56,6],[51,1,51,7],[52,1,52,7],[53,1,55,7]]}
[null,null,null,null,null,null,"File Number:",{"$f":"EBNUMBER","v":"EB-2017-0038"}]
[null,null,null,null,null,null,"Exhibit:",4]
[null,null,null,null,null,null,"Tab:",2]
[null,null,null,null,null,null,"Schedule:"]
[null,null,null,null,null,null,"Page:",14]
[]
[null,null,null,null,null,null,"Date:","Sept 12, 2017"]
[]
[]
["Appendix 2-JB"]
[{"$f":"\"Recoverable OM&A Cost Driver Table\" & CHAR(185)&CHAR(183)&CHAR(179)","v":"Recoverable OM&A Cost Driver Table¹·³"}]
[]
["OM&A",{"$f":"\"Last Rebasing Year (\"&RebaseYear&\" Actuals)\"","v":"Last Rebasing Year (2012 Actuals)"},{"$f":"BridgeYear -4 & \" Actuals\"","v":"2013 Actuals"},{"$f":"BridgeYear -3 & \" Actuals\"","v":"2014 Actuals"},{"$f":"BridgeYear -2 & \" Actuals\"","v":"2015 Actuals"},{"$f":"BridgeYear -1 & \" Actuals\"","v":"2016 Actuals"},{"$f":"BridgeYear & \" Bridge Year\"","v":"2017 Bridge Year"},{"$f":"TestYear & \" Test Year\"","v":"2018 Test Year"}]
["Reporting Basis"]
["Opening Balance",5660594,{"$f":"B48","v":5600728.870000001},5600728.870000001,5602948.9109120024,5792222.580744002,5992500.3112305943,6181909.0136989579]
[]
[]
["Affiliate Revenue Cost Offset",-272487]
["Increase in recovery from Affiliate One Time Project",{"$f":"-142510+88932","v":-53578}]
["Decrease in Labour for one FTE",-75470,null,-100345.77]
["Increase in Operating Costs for Capitalization Policy Change",258314.86,null,6594.2300000000396,10185.719999999972,19834.549999999988,6144.1199999999953,6273.140000000014]
["Inflation",83355,null,73328.504911999989,89611.662832000002,89647.183486592025,92675.562203904017,91173.505523458894]
["Change in Labour Costs",52548.720000000299,null,91828.992000000173,158660.908,3513.7860000000333,-174501.90840000054,44536.27555200029]
["Change in Benefit Costs",55451.290000000095,null,24213.083999999937,38734.284000000007,21204.365999999991,-43029.926135538655,10982.072717289348]
["Decrease in Consulting Costs COS application ended",-108000]
["Decrease in Rent",null,null,-34337]
["Decrease in Outside Services",null,null,-81705]
["Increase for Website ",null,null,22643]
["Increase for Scada",null,null,null,22402]
["Increase In Affiliate Costs",null,null,null,null,null,null,66633.651895999908]
["Decrease In Affiliate Costs",null,null,null,-15824.905000000028,-86822.155000000028,-60445.145199999912]
["Correction for Revenue from Affiliate",null,null,null,-114496]
["Increase for OMS",null,null,null,null,22412]
["Increase in Outside Services ",null,null,null,null,107088]
["Increase for ESA Survey 2015 and Customer Survey 2016",null,null,null,null,12000]
["Increase for Regulatory costs ESA ",null,null,null,null,11400]
["Increase in Regulatory Costs OEB Cost Assessment",null,null,null,null,null,86640]
["Increase for Meter Maintenance and disposals",null,null,null,null,null,71724]
["Increase to meet regulatory changes in CIS",null,null,null,null,null,27868]
["Increase for Customer engagement and My Account Portal",null,null,null,null,null,38672]
["Costs for preparation of DSP",null,null,null,null,null,143662,-143662]
["Cost of Service Application Expenses One Time",null,null,null,null,null,null,63422]
["Increase for Cyber Security and Risk Costs",null,null,null,null,null,null,135500]
[]
[]
[]
[]
[{"$f":"\"Closing Balance\"&CHAR(178)","v":"Closing Balance²"},{"$f":"SUM(B15:B47)","v":5600728.870000001},{"$f":"SUM(C15:C47)","v":5600728.870000001},5602948.9109120024,5792222.580744002,5992500.3112305943,{"$f":"SUM(G15:G47)","v":6181909.0136989579},6456767.6593877058]
[]
["Notes:"]
[]
[1,"For each year, a detailed explanation for each cost driver and associated amount is requied in Exhibit 4."]
[2,"Opening Balance for \"Last Rebasing Year\" (cell B15) should be equal to the Board-Approved amount. For purposes of assessing incremental cost drivers, the closing balance for each year becomes the opening balance for the next year."]
[3,"If it has been more than four years since the applicant last filed a cost of service application, additional years of historical actuals should be incorporated into the table, as necessary, to go back to the last cost of service application.  If the applicant last filed a cost of service application less than four years ago, a minimum of three years of actual information is required."]

{"sheet":"App.2-JC_OMA Programs","index":26,"n_rows":56,"n_cols":11,"rows_kept":56,"cut":false,"hidden":false,"merged":[[58,0,59,10],[8,0,8,9],[9,0,9,9],[11,0,11,9],[56,0,56,9],[54,0,54,10],[55,0,55,10]]}
[null,null,null,null,null,null,null,null,null,"File Number:","2017-0038"]
[null,null,null,null,null,null,null,null,null,"Exhibit:",4]
[null,null,null,null,null,null,null,null,null,"Tab:",3]
[null,null,null,null,null,null,null,null,null,"Schedule:"]
[null,null,null,null,null,null,null,null,null,"Page:",17]
[]
[null,null,null,null,null,null,null,null,null,"Date:","Sept 12, 2017"]
[]
["Appendix 2-JC"]
["OM&A Programs Table"]
[]
[]
["Programs","Last Rebasing Year (2012 Board-Approved)","Last Rebasing Year (2012 Actuals)","2013 Actuals","2014 Actuals","2015 Actuals","2016 Actuals","2017 Bridge Year","2018 Test Year","Variance \n(Test Year vs. 2016 Actuals)","Variance \n(Test Year vs. Last Rebasing Year (2012 Board-Approved)"]
["Reporting Basis","CGAAP","CGAAP","CGAAP","MIFRS","MIFRS","MIFRS","MIFRS","MIFRS"]
["Administration"]
["Administration"]
["General Building Expenses",465766.67216261511,398090.03,426218.16,414871.15,935689.28,991531.72,1045099,1046555,55024,{"$f":"I17-B17","v":580788.32783738489}]
["Salaries and Expenses",1664032.1288878338,1422245.6,2144410.1700000004,2468032.13,2537680.9300000002,2654946.42,2834411,2838361,{"$f":"I18-G18","v":183414.58000000007},{"$f":"I18-B18","v":1174328.8711121662}]
["Insurance",39383.190556160735,33660.75,26188.67,28128.240000000002,25072.39,28197.49,28004,28043,-154.4900000000016,-11340.190556160735]
["Office Expenses",140190.56294090417,119820.64999999998,74087.25,94764.95,69781.94,139937.45000000001,77942,78050,-61887.450000000012,-62140.562940904172]
["Audit, Legal and Consulting",549670.6199231972,469802.60000000003,255694.81,126796.88,208258.53,315346.3,232610,232934,-82412.299999999988,-316736.6199231972]
["Regulatory Affairs",79281.884592162081,67762.100000000006,132664.07,59336.92,78600.87,71081.259999999995,87792,285561,214479.74,206279.1154078379]
["Administrative & Human Resource Expenses",583417,496972,382108,211829,116215,156404,129804,129943,-26461,-453474]
["Rent",267478.30544206325,228613.28,219141.32,228677.02,227975.36,238525.16,254632,254905,16379.839999999997,-12573.305442063254]
[null,null,null,null,null,null,null,null,null,0,0]
["Sub-Total",3709593.3089198344,3170583.4699999997,3650977.47,3639091.15,4195351.46,4581128.45,4746507.6336499993,4950253.5700979093,369125.12009790912,1240660.2611780749]
[]
["Community Relations",null,18711,22086,22871,21168,24584,24584,24953,{"$f":"I28-G28","v":369},{"$f":"I28-B28","v":24953}]
["Sub-Total",79627.117483211914,68057.17,31620.769999999997,16215.369999999999,24849.61,39424.65,40094.869049999994,40776.481823849987,1351.8318238499851,-38850.635659361928]
[]
["Customer Service",null,null,null,null,null,null,null,null,0,0]
["Bad Debt",31927.367552950076,27288.27,112465.38,22618.05,87793.37,26204.23,53700,63538,{"$f":"I32-G32","v":37333.770000000004},{"$f":"I32-B32","v":31610.632447049924}]
["Customer Service & Billings",840788.28162606165,718620.4,866160.32,1036486.94,840661.94,799615.21,769310,781782,-17833.209999999963,-59006.281626061653]
["Customer Collections",114702.35567266116,98035.92,181767.8,188435.02,183012.24,155827.64000000001,175325,194987,{"$f":"I34-G34","v":39159.359999999986},{"$f":"I34-B34","v":80284.644327338843}]
["Sub-Total",987418.0048516728,843944.59000000008,1160393.5,1247540.01,1111467.5499999998,981647.08,998335.08035999979,1040306.7767261198,58659.696726119844,52888.771874447004]
[]
[]
["Maintenance",null,null,null,null,null,null,null,null,0,0]
["Meter Maintenance",134099.2637182308,114614.42629353776,158892.82999999999,36735.96,133663.82999999999,47531.29,90257,120885,{"$f":"I39-G39","v":73353.709999999992},{"$f":"I39-B39","v":-13214.263718230795}]
["Overhead / Underground Maintenance",354098.63649898017,302647.53846025089,340632.71000000008,391352.75,-45193.87999999999,144373.54999999999,197435,149324,4950.4500000000116,-204774.63649898017]
["Station Maintenance",49911.923031286824,42659.640812482961,28581.97,26687.85,53287.28,10735.22,13464,11103.319958579998,368.0999585799982,-38808.603072706828]
["Vegetation Control",103460.79860379537,88427.779146957022,83303.64,83105,136952.24,71793.78,41926,74255.516922419978,2461.7369224199792,-29205.281681375389]
["Transformer Maintenance",54834.062196043567,46866.585286771311,33749.449999999997,40277.85,41450.480000000003,12367.97,20320,12792.055323329998,424.08532332999857,-42042.006872713566]
["Sub-Total",696404.6840483367,595215.97,645160.6,578159.41,320159.94999999995,286801.80999999994,291677.44076999999,296635.95726308995,9834.1472630900098,-399768.72678524675]
[]
["Operations"]
["Operations Supervision and Engineering",67468.875480906077,57665.54,43165.71,40365.050000000003,42370.14,0,30691,38356,{"$f":"I47-G47","v":38356},{"$f":"I47-B47","v":-29112.875480906077}]
["Miscellaneous Operation ",120082.06621603714,102633.95,56930.49,69652.649999999994,86199.08,91573.77,62439,78033,3139.9729995300004,-25368.323216507139]
["Sub-Total",187550.94169694322,160299.49,100096.2,110017.7,128569.22,91573.77,93130.524090000006,116388.74299953,24814.97299953,-71162.198697413216]
[]
["Miscellaneous",null,null,12480,11925,11584,11925,12163,12407,482,12407]
["Total"]
["Notes:"]
[]
["1   Please provide a breakdown of the major components of each OM&A Program undertaken in each year.  Please ensure that all Programs below the materiality threshold are included in the miscellaneous line.  Add more Programs as required."]
["2   The applicant should group projects appropriately and avoid presentations that result in classification of significant components of the OM&A budget in the miscellaneous category"]

{"sheet":"App.2-K_Employee Costs","index":27,"n_rows":32,"n_cols":9,"rows_kept":32,"cut":false,"hidden":false,"merged":[[31,0,31,7],[8,0,8,7],[9,0,9,7],[12,0,12,8],[16,0,16,8],[20,0,20,8],[24,0,24,8]]}
[null,null,null,null,null,null,"File Number:",{"$f":"EBNUMBER","v":"EB-2017-0038"}]
[null,null,null,null,null,null,"Exhibit:",4]
[null,null,null,null,null,null,"Tab:",4]
[null,null,null,null,null,null,"Schedule:"]
[null,null,null,null,null,null,"Page:",28]
[]
[null,null,null,null,null,null,"Date:","Sept 12, 2017"]
[]
["Appendix 2-K"]
["Employee Costs"]
[]
[null,"Last Rebasing Year - 2012- Board Approved","Last Rebasing Year - 2012-  Actual","2013 Actuals","2014 Actuals","2015 Actuals","2016 Actuals","2017 Bridge Year","2018 Test Year"]
["Number of Employees (FTEs including Part-Time)1"]
["Management (including executive)",12,12,12,12,14,15,14,14]
["Non-Management (union and non-union)",33,32,33,33,31,31,30,30]
["Total",{"$f":"B14+B15","v":45},{"$f":"C14+C15","v":44},45,45,45,46,44,44]
["Total Salary and Wages including ovetime and incentive pay"]
["Management (including executive)",1080161,1152878.8899999999,1215962,1235070.32,1387431.5,1607297.42,1486771.18,1516506.6036]
["Non-Management (union and non-union)",2153368,2257488,2259558,2393498,2608905,2394895.39,2224585.1159999995,2269076.8183199996]
["Total",3233529,3410366.8899999997,3475520,3628568.3200000003,3996336.5,4002192.81,3711356.2959999992,3785583.4219199996]
["Total Benefits (Current + Accrued) 2"]
["Management (including executive)",255094.40750563351,269045.21999999997,297159.57,299098.82,334012.13,378586.11,351074.52579893271,358096.01631491148]
["Non-Management (union and non-union)",482454.39761131979,508839.26,549476.81000000006,587892.69999999995,617536.53,608303.16,564098.20064183627,575380.16465467308]
["Total",737548.80511695333,777884.48,846636.38000000012,886991.52,951548.66,986889.27,915172.72644076892,933476.1809695845]
["Total Compensation (Salary, Wages, & Benefits)"]
["Management (including executive)",1335255.4075056335,1421924.1099999999,1513121.57,1534169.1400000001,1721443.63,1985883.5299999998,1837845.7057989326,1874602.6199149115]
["Non-Management (union and non-union)",2635822.39761132,2766327.26,2809034.81,2981390.7,3226441.5300000003,3003198.5500000003,2788683.3166418355,2844456.9829746727]
["Total",3971077.8051169533,4188251.3699999996,4322156.38,4515559.84,4947885.16,4989082.08,4626529.0224407678,4719059.6028895844]
[]
["Note:"]
["1 If an applicant wishes to use headcount, it must also file the same schedule on an FTE basis."]
["2 Current employee benefits, plus Pension and Other Post-Employment Benefits costs, as recorded for recovery in distribution rates. Should be consistent with OPEBs costs as documented in Appendix 2-KA."]

{"sheet":"App.2-L_OM&A_per_Cust_FTE","index":28,"n_rows":38,"n_cols":11,"rows_kept":38,"cut":false,"hidden":false,"merged":[[13,1,13,2],[14,1,14,2],[15,1,15,2],[8,1,8,10],[9,1,9,10],[22,1,22,2],[25,1,25,2],[26,1,26,2],[16,1,16,2],[17,1,17,2],[18,1,18,2],[19,1,19,2],[20,1,20,2],[21,1,21,2],[37,2,37,10],[34,2,34,10],[35,2,35,10],[36,2,36,10],[32,2,33,10]]}
[null,null,null,null,null,null,null,null,null,"File Number:",{"$f":"EBNUMBER","v":"EB-2017-0038"}]
[null,null,null,null,null,null,null,null,null,"Exhibit:",4]
[null,null,null,null,null,null,null,null,null,"Tab:",2]
[null,null,null,null,null,null,null,null,null,"Schedule:"]
[null,null,null,null,null,null,null,null,null,"Page:",16]
[]
[null,null,null,null,null,null,null,null,null,"Date:","Sept 12, 2017"]
[]
[null,"Appendix 2-L"]
[null,"Recoverable OM&A Cost per Customer and per FTE 1"]
[]
[]
[null,null,null,{"$f":"\"Last Rebasing Year - \"&RebaseYear&\"- Board Approved\"","v":"Last Rebasing Year - 2012- Board Approved"},{"$f":"\"Last Rebasing Year - \"&RebaseYear&\"-  Actual\"","v":"Last Rebasing Year - 2012-  Actual"},{"$f":"BridgeYear -4 & \" Actuals\"","v":"2013 Actuals"},{"$f":"BridgeYear -3 & \" Actuals\"","v":"2014 Actuals"},{"$f":"BridgeYear -2 & \" Actuals\"","v":"2015 Actuals"},{"$f":"BridgeYear -1 & \" Actuals\"","v":"2016 Actuals"},{"$f":"BridgeYear & \" Bridge Year\"","v":"2017 Bridge Year"},{"$f":"TestYear & \" Test Year\"","v":"2018 Test Year"}]
[null,"Reporting Basis"]
[null,"OM&A Costs"]
[null,"     O&M",null,{"$f":"'App.2-JA_OM&A_Summary_Analys'!B17","v":883955.62574527995},{"$f":"'App.2-JA_OM&A_Summary_Analys'!C17","v":755515.46},{"$f":"'App.2-JA_OM&A_Summary_Analys'!D17","v":745256.79999999993},{"$f":"'App.2-JA_OM&A_Summary_Analys'!E17","v":688177.10999999987},{"$f":"'App.2-JA_OM&A_Summary_Analys'!F17","v":448729.16999999993},{"$f":"'App.2-JA_OM&A_Summary_Analys'!G17","v":378375.58},{"$f":"'App.2-JA_OM&A_Summary_Analys'!H17","v":456531.52409000002},{"$f":"'App.2-JA_OM&A_Summary_Analys'!I17","v":484748.74299952999}]
[null,"     Admin Expenses",null,{"$f":"'App.2-JA_OM&A_Summary_Analys'!B23","v":4776638.4312547194},{"$f":"'App.2-JA_OM&A_Summary_Analys'!C23","v":4099623},{"$f":"'App.2-JA_OM&A_Summary_Analys'!D23","v":4855472.3500000006},{"$f":"'App.2-JA_OM&A_Summary_Analys'!E23","v":4914771.53},{"$f":"'App.2-JA_OM&A_Summary_Analys'!F23","v":5343494},{"$f":"'App.2-JA_OM&A_Summary_Analys'!G23","v":5614126},{"$f":"'App.2-JA_OM&A_Summary_Analys'!H23","v":5725376.083060001},{"$f":"'App.2-JA_OM&A_Summary_Analys'!I23","v":5972020.6558857299}]
[null,"Total Recoverable OM&A from Appendix 2-JB 5",null,{"$f":"'App.2-JB_OM&A_Cost _Drivers'!B15","v":5660594},{"$f":"'App.2-JB_OM&A_Cost _Drivers'!B48","v":5600728.870000001},{"$f":"'App.2-JB_OM&A_Cost _Drivers'!C48","v":5600728.870000001},{"$f":"'App.2-JB_OM&A_Cost _Drivers'!D48","v":5602948.9109120024},{"$f":"'App.2-JB_OM&A_Cost _Drivers'!E48","v":5792222.580744002},{"$f":"'App.2-JB_OM&A_Cost _Drivers'!F48","v":5992500.3112305943},{"$f":"'App.2-JB_OM&A_Cost _Drivers'!G48","v":6181909.0136989579},{"$f":"'App.2-JB_OM&A_Cost _Drivers'!H48","v":6456767.6593877058}]
[null,"Number of Customers 2,4",null,18934,18784.25,18900.083333333336,19038.416666666672,19207.666666666668,19400.583333333332,19538.59394364282,19676.876814076422]
[null,"Number of FTEs 3,4",null,45,44,45,45,45,46,44,44]
[null,"Customers/FTEs",null,{"$f":"IF(D20=0,\"\",D19/D20)","v":420.75555555555553},{"$f":"IF(E20=0,\"\",E19/E20)","v":426.91477272727275},null,{"$f":"IF(G20=0,\"\",G19/G20)","v":423.07592592592601},426.83703703703708,421.75181159420288,444.05895326460956,447.20174577446414]
[null,"OM&A cost per customer"]
[null,"     O&M per customer",null,{"$f":"IF(D19=0,\"\",D16/D19)","v":46.686153255798033},{"$f":"IF(E19=0,\"\",E16/E19)","v":40.220688076447018},{"$f":"IF(F19=0,\"\",F16/F19)","v":39.431402859775744},{"$f":"IF(G19=0,\"\",G16/G19)","v":36.146761679236263},23.361982368151601,19.503309436571925,23.365628325498804,24.635451427573656]
[null,"     Admin per customer",null,{"$f":"IF(D19=0,\"\",D17/D19)","v":252.27835804662087},{"$f":"IF(E19=0,\"\",E17/E19)","v":218.24789384723906},{"$f":"IF(F19=0,\"\",F17/F19)","v":256.90216621619834},{"$f":"IF(G19=0,\"\",G17/G19)","v":258.15022415204339},278.19589400065945,289.37923687861621,293.02907361575217,303.50449984082189]
[null,"     Total OM&A per customer",null,{"$f":"IF(D19=0,\"\",D18/D19)","v":298.96450829196158},{"$f":"IF(E19=0,\"\",E18/E19)","v":298.16089915753895},{"$f":"IF(F19=0,\"\",F18/F19)","v":296.33355426122461},{"$f":"IF(G19=0,\"\",G18/G19)","v":294.29700006103457},301.55784569064446,308.88248091666975,316.39477392948925,328.13986286526278]
[null,"OM&A cost per FTE"]
[null,"     O&M per FTE",null,{"$f":"IF(D20=0,\"\",D16/D20)","v":19643.458349895111},{"$f":"IF(E20=0,\"\",E16/E20)","v":17170.805909090908},{"$f":"IF(F20=0,\"\",F16/F20)","v":16561.26222222222},{"$f":"IF(G20=0,\"\",G16/G20)","v":15292.824666666664},9971.7593333333316,8225.5560869565215,10375.71645659091,11017.016886352954]
[null,"     Admin per FTE",null,{"$f":"IF(D20=0,\"\",D17/D20)","v":106147.52069454933},{"$f":"IF(E20=0,\"\",E17/E20)","v":93173.25},{"$f":"IF(F20=0,\"\",F17/F20)","v":107899.38555555556},{"$f":"IF(G20=0,\"\",G17/G20)","v":109217.14511111112},118744.31111111111,122046.21739130435,130122.18370590912,135727.74217922112]
[null,"     Total OM&A per FTE",null,{"$f":"IF(D20=0,\"\",D18/D20)","v":125790.97777777778},{"$f":"IF(E20=0,\"\",E18/E20)","v":127289.29250000003},{"$f":"IF(F20=0,\"\",F18/F20)","v":124460.64155555557},{"$f":"IF(G20=0,\"\",G18/G20)","v":124509.9757980445},128716.05734986671,130271.74589631727,140497.93212952177,146744.71953153878]
[]
[null,"Notes:"]
[]
[null,1,"If it has been more than four years since the applicant last filed a cost of service application, additional years of historical actuals should be incorporated into the table, as necessary, to go back to the last cost of service application. If the applicant last filed a cost of service application less than four years ago, a minimum of three years of actual information is required."]
[]
[null,2,"The method of calculating the number of customers must be identified. Should correspond with data provided in Appendix 2-IB."]
[null,3,"The method of calculating the number of FTEs must be identified. See also Appendix 2-K."]
[null,4,"The number of customers and the number of FTEs should correspond to mid-year or average of January 1 and December 31 figures."]
[null,5,"For the test year, the applicant should take into account the system O&M (line 22 of Appendix 2-AB) in developing its forecasted OM&A."]

{"sheet":"App.2-L_OM&A_per_Cust_FTEE_exp","index":29,"n_rows":38,"n_cols":12,"rows_kept":38,"cut":false,"hidden":true,"merged":[[37,1,38,11],[36,1,36,11],[32,1,33,11],[19,0,19,1],[18,0,18,1],[20,0,20,1],[26,0,26,1],[8,0,8,11],[9,0,9,11],[34,1,34,6],[35,1,35,6],[21,0,21,1],[22,0,22,1],[25,0,25,1],[14,0,14,1],[13,0,13,1],[11,7,11,11],[15,0,15,1],[16,0,16,1],[17,0,17,1]]}
[null,null,null,null,null,null,null,null,null,null,"File Number:",{"$f":"EBNUMBER","v":"EB-2017-0038"}]
[null,null,null,null,null,null,null,null,null,null,"Exhibit:"]
[null,null,null,null,null,null,null,null,null,null,"Tab:"]
[null,null,null,null,null,null,null,null,null,null,"Schedule:"]
[null,null,null,null,null,null,null,null,null,null,"Page:"]
[]
[null,null,null,null,null,null,null,null,null,null,"Date:"]
[]
["Appendix 2-L"]
["Recoverable OM&A Cost per Customer and per FTE 1"]
[]
[null,null,null,null,null,null,null,"5-year Distribution System Plan Period"]
[null,null,{"$f":"\"Last Rebasing Year - \"&RebaseYear&\"- Board Approved\"","v":"Last Rebasing Year - 2012- Board Approved"},{"$f":"\"Last Rebasing Year - \"&RebaseYear&\"-  Actual\"","v":"Last Rebasing Year - 2012-  Actual"},{"$f":"BridgeYear -2 & \" Actuals\"","v":"2015 Actuals"},{"$f":"BridgeYear -1 & \" Actuals\"","v":"2016 Actuals"},{"$f":"BridgeYear & \" Bridge Year\"","v":"2017 Bridge Year"},{"$f":"TestYear & \" Test Year\"","v":"2018 Test Year"},{"$f":"TestYear+1 & \" Year\"","v":"2019 Year"},{"$f":"TestYear+2 & \" Year\"","v":"2020 Year"},{"$f":"TestYear+3 & \" Year\"","v":"2021 Year"},{"$f":"TestYear+4 & \" Year\"","v":"2022 Year"}]
["Reporting Basis"]
["OM&A Costs"]
["     O&M"]
["     Admin Expenses"]
["Total Recoverable OM&A from Appendix 2-JB 5",null,{"$f":"SUM(C16:C17)","v":0},{"$f":"SUM(D16:D17)","v":0},0,0,0,0,0,0,0,0]
["Number of Customers 2,4"]
["Number of FTEs 3,4"]
["Customers/FTEs",null,{"$f":"IF(C20=0,\"\",C19/C20)","v":""},{"$f":"IF(D20=0,\"\",D19/D20)","v":""},"","","","","","","",""]
["OM&A cost per customer"]
["     O&M per customer",null,{"$f":"IF(C19=0,\"\",C16/C19)","v":""},{"$f":"IF(D19=0,\"\",D16/D19)","v":""},"","","","","","","",""]
["     Admin per customer",null,{"$f":"IF(C19=0,\"\",C17/C19)","v":""},{"$f":"IF(D19=0,\"\",D17/D19)","v":""},"","","","","","","",""]
["     Total OM&A per customer",null,{"$f":"IF(C19=0,\"\",C18/C19)","v":""},{"$f":"IF(D19=0,\"\",D18/D19)","v":""},"","","","","","","",""]
["OM&A cost per FTE"]
["     O&M per FTE",null,{"$f":"IF(C20=0,\"\",C16/C20)","v":""},{"$f":"IF(D20=0,\"\",D16/D20)","v":""},"","","","","","","",""]
["     Admin per FTE",null,{"$f":"IF(C20=0,\"\",C17/C20)","v":""},{"$f":"IF(D20=0,\"\",D17/D20)","v":""},"","","","","","","",""]
["     Total OM&A per FTE",null,{"$f":"IF(C20=0,\"\",C18/C20)","v":""},{"$f":"IF(D20=0,\"\",D18/D20)","v":""},"","","","","","","",""]
[]
["Notes:"]
[]
[1,"If it has been more than three years since the applicant last filed a cost of service application, additional years of historical actuals should be incorporated into the table, as necessary, to go back to the last cost of service application.  If the applicant last filed a cost of service application less than three years ago, a minimum of three years of actual information is required."]
[]
[2,"The method of calculating the number of customers must be identified. Should be linked back to Appendix 2-IA"]
[3,"The method of calculating the number of FTEs must be identified.  See also Appendix 2-K"]
[4,"The number of customers and the number of FTEs should correspond to mid-year or average of January 1 and December 31 figures."]
[5,"For the test year and in the subsequent four years of the DSP period, the applicant should take into account the system O&M (line X of Appendix 2-AB) in developing its forecasted OM&A. Admin expenses beyond the test year also need to be forecasted (separately)."]

{"sheet":"App.2-M_Regulatory_Costs","index":30,"n_rows":46,"n_cols":11,"rows_kept":46,"cut":false,"hidden":false,"merged":[[12,0,12,1],[13,0,13,1],[8,0,8,10],[9,0,9,10]]}
[null,null,null,null,null,null,null,null,null,"File Number:",{"$f":"EBNUMBER","v":"EB-2017-0038"}]
[null,null,null,null,null,null,null,null,null,"Exhibit:",4]
[null,null,null,null,null,null,null,null,null,"Tab:",7]
[null,null,null,null,null,null,null,null,null,"Schedule:"]
[null,null,null,null,null,null,null,null,null,"Page:",46]
[]
[null,null,null,null,null,null,null,null,null,"Date:","Sept 12, 2017"]
[]
["Appendix 2-M"]
["Regulatory Cost Schedule"]
[]
[]
["Regulatory Cost Category",null,"USoA Account","USoA Account Balance","Ongoing or One-time Cost? 2",{"$f":"\"Last Rebasing Year (\" & RebaseYear & \" Board Approved)\"","v":"Last Rebasing Year (2012 Board Approved)"},{"$f":"\"Most Current Actuals               Year \" & TestYear - 2","v":"Most Current Actuals               Year 2016"},{"$f":"TestYear -1 & \" Bridge Year\"","v":"2017 Bridge Year"},"Annual % Change",{"$f":"TestYear & \" Test Year\"","v":"2018 Test Year"},"Annual % Change"]
["(A)",null,"(B)","(C )","(D)","(E)","(F)","(G)","(H) = [(G)-(F)]/(F)","(I)","(J) = [(I)-(G)]/(G)"]
[1,"OEB Annual Assessment",5655,71081.259999999995,"On-Going",53948,71081.259999999995,83308,{"$f":"IF(G15=0,\"\",(H15-G15)/G15)","v":0.17201073813266685},86640.320000000007,{"$f":"IF(H15=0,\"\",(J15-H15)/H15)","v":4.0000000000000084E-2}]
[2,"OEB Section 30 Costs (Applicant-originated)",5655,71081.259999999995,"On-Going",null,71081.259999999995,{"$f":"87500-H15","v":4192},{"$f":"IF(G16=0,\"\",(H16-G16)/G16)","v":-0.94102524350299921},5500,{"$f":"IF(H16=0,\"\",(J16-H16)/H16)","v":0.31202290076335876}]
[3,"OEB Section 30 Costs (OEB-initiated)",null,null,null,null,null,null,"",null,""]
[4,"Expert Witness costs for regulatory matters",null,null,"One-Time",15000,null,null,"",null,""]
[5,"Legal costs for regulatory matters",5630,315346.3,"One-Time",75000,7401.36,58594.1,6.916666666666667,23437.64,-0.6]
[6,"Consultants' costs for regulatory matters",5630,315346.3,"One-Time",105000,4598.6400000000003,36405.9,6.916666666666667,14562.36,-0.6]
[7,"Operating expenses associated with staff resources allocated to regulatory matters",5630,315346.3,"One-Time",null,57105.26,28000,{"$f":"IF(G21=0,\"\",(H21-G21)/G21)","v":-0.50967739224022446},5000,{"$f":"IF(H21=0,\"\",(J21-H21)/H21)","v":-0.8214285714285714}]
[8,"Operating expenses associated with other resources allocated to regulatory matters 1",5630,{"$f":"D21","v":315346.3},"One-Time",null,null,null,"",12000,""]
[9,"Other regulatory agency fees or assessments",null,null,null,null,null,null,"",null,""]
[10,"Any other costs for regulatory matters (please define) Cyber Security and Risk",5655,{"$f":"D16","v":71081.259999999995},"On-Going",null,null,null,"",130000,""]
[11,"Intervenor costs",null,null,null,30000,0,0,"",70000,{"$f":"IF(H25=0,\"\",(J25-H25)/H25)","v":""}]
[12,"Sub-total - Ongoing Costs 3",null,{"$f":"SUMIF($E15:$E25,$E11,D15:D25)","v":0},null,{"$f":"SUMIF($E15:$E25,$E11,F15:F25)","v":0},{"$f":"SUMIF($E15:$E25,$E11,G15:G25)","v":0},{"$f":"SUMIF($E15:$E25,$E11,H15:H25)","v":0},"",{"$f":"SUMIF($E15:$E25,$E11,J15:J25)","v":0},""]
[13,"Sub-total - One-time Costs 4",null,{"$f":"SUMIF($E15:$E25,$E12,D15:D25)","v":0},null,{"$f":"SUMIF($E15:$E25,$E12,F15:F25)","v":0},{"$f":"SUMIF($E15:$E25,$E12,G15:G25)","v":0},{"$f":"SUMIF($E15:$E25,$E12,H15:H25)","v":0},"",{"$f":"SUMIF($E15:$E25,$E12,J15:J25)","v":0},""]
[14,"Total",null,{"$f":"D26+D27","v":0},null,{"$f":"F26+F27","v":0},{"$f":"G26+G27","v":0},{"$f":"H26+H27","v":0},"",{"$f":"J26+J27","v":0},""]
[]
[]
["Please fill out the following table for all one-time costs related to this cost of service application to be amortized over the test year plus the IRM period."]
[]
[null,null,"Historical Year(s)",{"$f":"H13","v":"2017 Bridge Year"},{"$f":"J13","v":"2018 Test Year"}]
[4,"Expert Witness costs"]
[5,"Legal costs",7401.36,58594.1,23437.64]
[6,"Consultants' costs",4598.6400000000003,36405.9,14562.36]
[7,"Incremental operating expenses associated with staff resources allocated to this application.",57105.26,28000,5000]
[8,"Incremental operating expenses associated with other resources allocated to this application. 1",null,null,12000]
[11,"Intervenor costs",null,null,70000]
[]
["Notes:"]
[]
["1","Please identify the resources involved."]
["2","Where a category's costs include both one-time and ongoing costs, the applicant should prove a separate breakdown between one-time and ongoing costs."]
["3","Sum of all ongoing costs identified in rows 1 to 11 inclusive."]
["4","Sum of all one-time costs identified in rows 1 to 11 inclusive."]

{"sheet":"App.2-N_Corp_Cost_Allocation","index":31,"n_rows":334,"n_cols":8,"rows_kept":334,"cut":false,"hidden":false,"merged":[[15,7,16,7],[32,1,32,2],[32,3,34,3],[32,4,34,4],[32,6,33,6],[32,5,33,5],[33,1,34,1],[33,2,34,2],[30,1,30,6],[51,1,51,6],[54,1,54,6],[57,1,57,6],[13,1,13,6],[8,1,8,6],[9,1,9,6],[47,2,48,6],[16,1,17,1],[16,2,17,2],[15,3,17,3],[15,4,17,4],[15,1,15,2],[15,5,16,5],[15,6,16,6],[275,5,276,5],[275,6,276,6],[276,1,277,1],[276,2,277,2],[321,1,321,6],[323,1,323,2],[323,3,325,3],[323,4,325,4],[323,5,324,5],[323,6,324,6],[324,1,325,1],[324,2,325,2],[301,1,301,6],[302,1,302,6],[306,1,306,6],[308,1,308,2],[308,3,310,3],[308,4,310,4],[308,5,309,5],[308,6,309,6],[226,1,226,6],[228,1,228,2],[228,3,230,3],[228,4,230,4],[228,5,229,5],[228,6,229,6],[229,1,230,1],[229,2,230,2],[309,1,310,1],[309,2,310,2],[253,1,253,6],[254,1,254,6],[258,1,258,6],[260,1,260,2],[260,3,262,3],[260,4,262,4],[260,5,261,5],[260,6,261,6],[261,1,262,1],[261,2,262,2],[273,1,273,6],[275,1,275,2],[275,3,277,3],[275,4,277,4],[205,1,205,6],[206,1,206,6],[210,1,210,6],[212,1,212,2],[212,3,214,3],[212,4,214,4],[212,5,213,5],[212,6,213,6],[166,1,167,1],[166,2,167,2],[179,1,179,6],[181,1,181,2],[181,3,183,3],[181,4,183,4],[181,5,182,5],[181,6,182,6],[182,1,183,1],[182,2,183,2],[213,1,214,1],[213,2,214,2],[158,1,158,6],[159,1,159,6],[163,1,163,6],[165,1,165,2],[165,3,167,3],[165,4,167,4],[165,5,166,5],[165,6,166,6],[114,1,115,1],[114,2,115,2],[127,1,127,6],[129,1,129,2],[129,3,131,3],[129,4,131,4],[129,5,130,5],[129,6,130,6],[130,1,131,1],[130,2,131,2],[107,1,107,6],[111,1,111,6],[113,1,113,2],[113,3,115,3],[113,4,115,4],[113,5,114,5],[113,6,114,6],[67,1,68,1],[67,2,68,2],[78,1,78,6],[80,1,80,2],[80,3,82,3],[80,4,82,4],[80,5,81,5],[80,6,81,6],[81,1,82,1],[81,2,82,2],[64,1,64,6],[66,1,66,2],[66,3,68,3],[66,4,68,4],[66,5,67,5],[66,6,67,6],[59,1,59,6],[60,1,60,6],[106,1,106,6]]}
[null,null,null,null,null,null,"File Number:",{"$f":"EBNUMBER","v":"EB-2017-0038"}]
[null,null,null,null,null,null,"Exhibit:",4]
[null,null,null,null,null,null,"Tab:",5]
[null,null,null,null,null,null,"Schedule:"]
[null,null,null,null,null,null,"Page:","37-42"]
[]
[null,null,null,null,null,null,"Date:","Sept 12, 2017"]
[]
[null,"Appendix 2-N"]
[null,"Shared Services and Corporate Cost Allocation 1"]
[]
[null,null,"Year:",2012]
[]
[null,"Shared Services"]
[]
[null,"Name of Company",null,"Service Offered","Pricing Methodology","Price for the Service","Cost for the Service"]
[null,"From","To"]
[null,null,null,null,null,"$","$"]
[null,"ERTH Hldgs","Erie Thames Powerlines","IT Work ","Fully Allocated Costs",null,31057.5]
[null,"ERTH Hldgs","Erie Thames Powerlines","Billing Services","Fully Allocated Costs",null,231028.19]
[null,"ERTH Hldgs","Erie Thames Powerlines","MSP","Market Value",null,70560]
[null,"ERTH Hldgs","Erie Thames Powerlines","AMV","Market Value",null,3613]
[]
[]
[]
[null,"Erie Thames Powerlines","ERTH Hldgs","Billing Services","Fully Allocated Costs",393236.6]
[]
[null,"Erie Thames Powerlines","ERTH Corp","Eng/Ops/ Services ","Fully Allocated Costs",{"$f":"792741.32-631953.96","v":160787.35999999999}]
[]
[]
[null,"Corporate Cost Allocation"]
[]
[null,"Name of Company",null,"Service Offered","Pricing Methodology","% of Corporate Costs Allocated","Amount Allocated"]
[null,"From","To"]
[null,null,null,null,null,"%","$"]
[null,"ERTH Corp","Erie Thames Powerlines","Rent","Market Value",0.19788368605232462,190000]
[null,"ERTH Corp","Erie Thames Powerlines","Board Corporate Governance Costs","Fully Allocated Costs",5.0308281953007829E-2,48304]
[null,"ERTH Corp","Erie Thames Powerlines","IT Infrastructure","Fully Allocated Costs",0.1338308198633561,128499]
[null,"ERTH Corp","Erie Thames Powerlines","Legal","Fully Allocated Costs",0.13528891018163638,129899]
[null,"ERTH Corp","Erie Thames Powerlines","Business Development","Fully Allocated Costs",0,0]
[null,"ERTH Corp","Erie Thames Powerlines","Shared Costs","Fully Allocated Costs",5.7280036660556574E-2,54998]
[null,"ERTH Corp","Erie Thames Powerlines","Human resourses","Fully Allocated Costs",4.7904515914014331E-2,45996]
[null,"ERTH Corp","Erie Thames Powerlines","Management Fees","Fully Allocated Costs",0.37750374937510417,362464]
[]
[]
[]
[null,"Note: "]
[null,1,"This appendix must be completed in relation to each service provided or received for the Historical (actuals), Bridge and Test years. The required information includes:"]
[]
[]
[null,"·         Type of Service:"]
[null,"Services such as billing, accounting, payroll, etc.  The applicant must identify any costs related to the Board of Directors of the parent company that are allocated to the applicant."]
[]
[null,"·         Pricing Methodology:"]
[null,"Pricing Methodology includes approaches such as cost-base, market-base, tendering, etc.  The applicant must provide evidence demonstrating the pricing methodology used.  The applicant must also provide a description of why that pricing methodology was chosen, whether or not it is in conformity with ARC, and why it is appropriate."]
[]
[null,"·         % Allocation:"]
[null,"The applicant must provide the percentage of the costs allocated to the entity for the service being offered.  The Applicant must also provide a description of the allocator and why it is an appropriate allocator."]
[]
[null,"Appendix 2-N"]
[null,"Shared Services and Corporate Cost Allocation 1"]
[]
[null,null,"Year:",2013]
[]
[null,"Shared Services"]
[]
[null,"Name of Company",null,"Service Offered","Pricing Methodology","Price for the Service","Cost for the Service"]
[null,"From","To"]
[null,null,null,null,null,"$","$"]
[null,"ERTH Hldgs","Erie Thames Powerlines","IT Work ","Fully Allocated Costs",null,109224]
[null,"ERTH Hldgs","Erie Thames Powerlines","Billing Services","Fully Allocated Costs",null,251250]
[null,"ERTH Hldgs","Erie Thames Powerlines","MSP","Market Value",null,70560]
[null,"ERTH Hldgs","Erie Thames Powerlines","AMV","Market Value",null,28069]
[]
[null,"Erie Thames Powerlines","ERTH Corp","Eng/Ops/ Services to Goderich","Fully Allocated Costs",165065.64000000001]
[]
[null,"Erie Thames Powerlines","ERTH Hldgs","Billing Services","Fully Allocated Costs",365862.55]
[]
[null,"Corporate Cost Allocation"]
[]
[null,"Name of Company",null,"Service Offered","Pricing Methodology","% of Corporate Costs Allocated","Amount Allocated"]
[null,"From","To"]
[null,null,null,null,null,"%","$"]
[null,"ERTH Corp","Erie Thames Powerlines","Rent","Market Value",0.17416716014028708,190000]
[null,"ERTH Corp","Erie Thames Powerlines","Board Corporate Governance Costs","Fully Allocated Costs",4.7185550359059351E-2,51475]
[null,"ERTH Corp","Erie Thames Powerlines","IT Infrastructure","Fully Allocated Costs",0.12069692530795503,131669]
[null,"ERTH Corp","Erie Thames Powerlines","Legal","Fully Allocated Costs",6.7756525310155039E-2,73916]
[null,"ERTH Corp","Erie Thames Powerlines","Business Development","Fully Allocated Costs",6.7283523969984584E-3,7340]
[null,"ERTH Corp","Erie Thames Powerlines","Shared Costs","Fully Allocated Costs",3.7164521966145572E-2,40543]
[null,"ERTH Corp","Erie Thames Powerlines","Human resourses","Fully Allocated Costs",4.9690807457287794E-2,54208]
[null,"ERTH Corp","Erie Thames Powerlines","Management Fees","Fully Allocated Costs",0.4966101570621117,541755]
[]
[]
[]
[]
[]
[]
[]
[]
[]
[]
[]
[]
[]
[]
[]
[null,"Appendix 2-N"]
[null,"Shared Services and Corporate Cost Allocation 1"]
[]
[null,null,"Year:",2014]
[]
[null,"Shared Services"]
[]
[null,"Name of Company",null,"Service Offered","Pricing Methodology","Price for the Service","Cost for the Service"]
[null,"From","To"]
[null,null,null,null,null,"$","$"]
[null,"ERTH Hldgs","Erie Thames Powerlines","IT Work ","Fully Allocated Costs",null,12000]
[null,"ERTH Hldgs","Erie Thames Powerlines","Billing Services","Fully Allocated Costs",null,262963.80000000005]
[null,"ERTH Hldgs","Erie Thames Powerlines","MSP","Market Value",null,70560]
[null,"ERTH Hldgs","Erie Thames Powerlines","AMV","Market Value",null,4200]
[null,"ERTH Hldgs","Erie Thames Powerlines","Optimizer - Support/Mtnce","Market Value",null,40000]
[null,"ERTH Hldgs","Erie Thames Powerlines","Data Mining","Fully Allocated Costs",null,24000]
[]
[null,"Erie Thames Powerlines","ERTH Hldgs","Billing Services","Fully Allocated Costs",403321.14]
[]
[null,"Erie Thames Powerlines","ERTH Corp","Eng/Ops/ Services ","Fully Allocated Costs",134512.42000000001]
[]
[null,"Corporate Cost Allocation"]
[]
[null,"Name of Company",null,"Service Offered","Pricing Methodology","% of Corporate Costs Allocated","Amount Allocated"]
[null,"From","To"]
[null,null,null,null,null,"%","$"]
[null,"ERTH Corp","Erie Thames Powerlines","Rent","Market Value",0.16097988850768502,205000]
[null,"ERTH Corp","Erie Thames Powerlines","Board Corporate Governance Costs","Fully Allocated Costs",4.643445252310454E-2,59132]
[null,"ERTH Corp","Erie Thames Powerlines","IT Infrastructure","Fully Allocated Costs",0.10183195113121746,129678]
[null,"ERTH Corp","Erie Thames Powerlines","Legal","Fully Allocated Costs",4.2256042831644094E-2,53811]
[null,"ERTH Corp","Erie Thames Powerlines","Business Development","Fully Allocated Costs",0,0]
[null,"ERTH Corp","Erie Thames Powerlines","Shared Costs","Fully Allocated Costs",6.7035951913344133E-2,85367]
[null,"ERTH Corp","Erie Thames Powerlines","Human resourses","Fully Allocated Costs",5.8436484796038482E-2,74416]
[null,"ERTH Corp","Erie Thames Powerlines","Management Fees","Fully Allocated Costs",0.52302522829696629,666047]
[]
[]
[]
[]
[]
[]
[]
[]
[]
[]
[]
[]
[]
[]
[]
[]
[]
[]
[null,"Appendix 2-N"]
[null,"Shared Services and Corporate Cost Allocation 1"]
[]
[null,null,"Year:",2015]
[]
[null,"Shared Services"]
[]
[null,"Name of Company",null,"Service Offered","Pricing Methodology","Price for the Service","Cost for the Service"]
[null,"From","To"]
[null,null,null,null,null,"$","$"]
[null,"ERTH Hldgs","Erie Thames Powerlines","IT Work ","Fully Allocated Costs",null,170000]
[null,"ERTH Hldgs","Erie Thames Powerlines","Billing Services","Fully Allocated Costs",null,269537.89500000002]
[null,"ERTH Hldgs","Erie Thames Powerlines","MSP","Market Value",null,70560]
[null,"ERTH Hldgs","Erie Thames Powerlines","AMV","Market Value",null,4200]
[null,"ERTH Hldgs","Erie Thames Powerlines","Optimizer - Support/Mtnce","Market Value",null,40000]
[]
[null,"Erie Thames Powerlines","ERTH Hldgs","Billing Services",null,341704.82]
[]
[null,"Erie Thames Powerlines","ERTH Corp","Eng/Ops/ Services ","Fully Allocated Costs",106638.08]
[]
[]
[null,"Corporate Cost Allocation"]
[]
[null,"Name of Company",null,"Service Offered","Pricing Methodology","% of Corporate Costs Allocated","Amount Allocated"]
[null,"From","To"]
[null,null,null,null,null,"%","$"]
[null,"ERTH Corp","Erie Thames Powerlines","Rent","Market Value",0.15231689224798409,200000]
[null,"ERTH Corp","Erie Thames Powerlines","Board Corporate Governance Costs","Fully Allocated Costs",6.1353244197487992E-2,80560]
[null,"ERTH Corp","Erie Thames Powerlines","IT Infrastructure","Fully Allocated Costs",4.0287817999591788E-2,52900]
[null,"ERTH Corp","Erie Thames Powerlines","Legal","Fully Allocated Costs",5.4834081209274271E-2,72000]
[null,"ERTH Corp","Erie Thames Powerlines","Business Development","Fully Allocated Costs",0]
[null,"ERTH Corp","Erie Thames Powerlines","Shared Costs","Fully Allocated Costs",4.4366864373992808E-2,58256]
[null,"ERTH Corp","Erie Thames Powerlines","Human resourses","Fully Allocated Costs",6.1779731495782343E-2,81120]
[null,"ERTH Corp","Erie Thames Powerlines","Management Fees","Fully Allocated Costs",0.58506136847588674,548216]
[]
[]
[]
[]
[]
[]
[]
[]
[]
[]
[]
[]
[]
[null,"Appendix 2-N"]
[null,"Shared Services and Corporate Cost Allocation 1"]
[]
[null,null,"Year:",2016]
[]
[null,"Shared Services"]
[]
[null,"Name of Company",null,"Service Offered","Pricing Methodology","Price for the Service","Cost for the Service"]
[null,"From","To"]
[null,null,null,null,null,"$","$"]
[null,"ERTH Hldgs","Erie Thames Powerlines","IT Work ","Fully Allocated Costs",null,170000]
[null,"ERTH Hldgs","Erie Thames Powerlines","Billing Services","Fully Allocated Costs",null,231121.45]
[null,"ERTH Hldgs","Erie Thames Powerlines","MSP","Market Value",null,50535]
[null,"ERTH Hldgs","Erie Thames Powerlines","AMV","Market Value",null,3371.29]
[]
[]
[null,"Erie Thames Powerlines","ERTH Hldgs","Billing Services","Fully Allocated Costs",438576.1]
[]
[null,"Erie Thames Powerlines","ERTH Corp","Eng/Ops/ Services ","Fully Allocated Costs",145116.14000000001]
[]
[]
[null,"Corporate Cost Allocation"]
[]
[null,"Name of Company",null,"Service Offered","Pricing Methodology","% of Corporate Costs Allocated","Amount Allocated"]
[null,"From","To"]
[null,null,null,null,null,"%","$"]
[null,"ERTH Corp","Erie Thames Powerlines","Rent","Market Value",0.16530532866588876,212500]
[null,"ERTH Corp","Erie Thames Powerlines","Board Corporate Governance Costs","Fully Allocated Costs",2.1781408012446518E-2,28000]
[null,"ERTH Corp","Erie Thames Powerlines","IT Infrastructure","Fully Allocated Costs",4.5896538311940877E-2,59000]
[null,"ERTH Corp","Erie Thames Powerlines","Legal","Fully Allocated Costs",0.10968494749124855,141000]
[null,"ERTH Corp","Erie Thames Powerlines","Business Development","Fully Allocated Costs",0]
[null,"ERTH Corp","Erie Thames Powerlines","Shared Costs","Fully Allocated Costs",5.6009334889148193E-2,72000]
[null,"ERTH Corp","Erie Thames Powerlines","Human resourses","Fully Allocated Costs",2.9560482302605991E-2,38000]
[null,"ERTH Corp","Erie Thames Powerlines","Management Fees","Fully Allocated Costs",0.57176196032672111,515000]
[]
[]
[]
[]
[]
[]
[]
[]
[]
[]
[]
[]
[]
[]
[null,"Appendix 2-N"]
[null,"Shared Services and Corporate Cost Allocation 1"]
[]
[null,null,"Year:",2017]
[]
[null,"Shared Services"]
[]
[null,"Name of Company",null,"Service Offered","Pricing Methodology","Price for the Service","Cost for the Service"]
[null,"From","To"]
[null,null,null,null,null,"$","$"]
[null,"ERTH Hldgs","Erie Thames Powerlines","IT Work ","Fully Allocated Costs",null,191000]
[null,"ERTH Hldgs","Erie Thames Powerlines","Billing Services","Fully Allocated Costs",null,235743.87900000002]
[null,"ERTH Hldgs","Erie Thames Powerlines","MSP","Market Value",null,72900]
[null,"ERTH Hldgs","Erie Thames Powerlines","AMV","Market Value",null,3438.7157999999999]
[]
[null,"Erie Thames Powerlines","ERTH Corp","Eng/Ops/ Services ","Fully Allocated Costs",148018.46280000001]
[]
[null,"Erie Thames Powerlines","ERTH Hldgs","Billing Services","Fully Allocated Costs",447347.62199999997]
[]
[]
[null,"Corporate Cost Allocation"]
[]
[null,"Name of Company",null,"Service Offered","Pricing Methodology","% of Corporate Costs Allocated","Amount Allocated"]
[null,"From","To"]
[null,null,null,null,null,"%","$"]
[null,"ERTH Corp","Erie Thames Powerlines","Rent","Market Value",0.22622779519331243,216500]
[null,"ERTH Corp","Erie Thames Powerlines","Board Corporate Governance Costs","Fully Allocated Costs",2.0898641588296761E-2,20000]
[null,"ERTH Corp","Erie Thames Powerlines","IT Infrastructure","Fully Allocated Costs",5.9561128526645767E-2,57000]
[null,"ERTH Corp","Erie Thames Powerlines","Legal","Fully Allocated Costs",8.254963427377221E-2,79000]
[null,"ERTH Corp","Erie Thames Powerlines","Business Development","Fully Allocated Costs",0]
[null,"ERTH Corp","Erie Thames Powerlines","Shared Costs","Fully Allocated Costs",8.5684430512016713E-2,82000]
[null,"ERTH Corp","Erie Thames Powerlines","Human resourses","Fully Allocated Costs",4.2842215256008356E-2,41000]
[null,"ERTH Corp","Erie Thames Powerlines","Management Fees","Fully Allocated Costs",0.48223615464994773,461500]
[]
[]
[]
[]
[]
[]
[]
[]
[]
[]
[]
[]
[]
[]
[]
[null,"Appendix 2-N"]
[null,"Shared Services and Corporate Cost Allocation 1"]
[]
[null,null,"Year:",2018]
[]
[null,"Shared Services"]
[]
[null,"Name of Company",null,"Service Offered","Pricing Methodology","Price for the Service","Cost for the Service"]
[null,"From","To"]
[null,null,null,null,null,"$","$"]
[null,"ERTH Hldgs","Erie Thames Powerlines","IT Work ","Fully Allocated Costs",null,217849.99999999997]
[null,"ERTH Hldgs","Erie Thames Powerlines","Billing Services","Fully Allocated Costs",null,240458.75658000002]
[null,"ERTH Hldgs","Erie Thames Powerlines","MSP","Market Value",null,72900]
[null,"ERTH Hldgs","Erie Thames Powerlines","AMV","Market Value",null,3507.4901159999999]
[]
[null,"Erie Thames Powerlines","ERTH Corp","Eng/Ops/ Services","Fully Allocated Costs",150978.83205600001]
[]
[null,"Erie Thames Powerlines","ERTH Hldgs","Billing Services","Fully Allocated Costs",456294.57444]
[]
[]
[null,"Corporate Cost Allocation"]
[]
[null,"Name of Company",null,"Service Offered","Pricing Methodology","% of Corporate Costs Allocated","Amount Allocated"]
[null,"From","To"]
[null,null,null,null,null,"%","$"]
[null,"ERTH Corp","Erie Thames Powerlines","Rent","Market Value",0.22479334677419355,222995]
[null,"ERTH Corp","Erie Thames Powerlines","Board Corporate Governance Costs","Fully Allocated Costs",2.0766129032258066E-2,20600]
[null,"ERTH Corp","Erie Thames Powerlines","IT Infrastructure","Fully Allocated Costs",5.8608870967741936E-2,58140]
[null,"ERTH Corp","Erie Thames Powerlines","Legal","Fully Allocated Costs",7.9637096774193547E-2,79000]
[null,"ERTH Corp","Erie Thames Powerlines","Business Development","Fully Allocated Costs",0,0]
[null,"ERTH Corp","Erie Thames Powerlines","Shared Costs","Fully Allocated Costs",8.5141129032258067E-2,84460]
[null,"ERTH Corp","Erie Thames Powerlines","Human resourses","Fully Allocated Costs",4.2570564516129034E-2,42230]
[null,"ERTH Corp","Erie Thames Powerlines","Management Fees","Fully Allocated Costs",0.48848286290322579,484575]

{"sheet":"App.2-OA Capital Structure","index":32,"n_rows":35,"n_cols":15,"rows_kept":35,"cut":false,"hidden":false,"merged":[[40,2,40,14],[12,0,12,14],[34,2,34,14],[35,2,35,14],[36,2,36,14],[37,2,37,14],[38,2,38,14],[39,2,39,14],[33,0,33,14],[9,2,9,14],[10,2,10,14],[16,0,17,0],[17,4,17,8],[14,7,14,9]]}
[null,null,null,null,null,null,null,null,null,null,"File Number:",null,null,null,{"$f":"EBNUMBER","v":"EB-2017-0038"}]
[null,null,null,null,null,null,null,null,null,null,"Exhibit:",null,null,null,5]
[null,null,null,null,null,null,null,null,null,null,"Tab:",null,null,null,2]
[null,null,null,null,null,null,null,null,null,null,"Schedule:"]
[null,null,null,null,null,null,null,null,null,null,"Page:",null,null,null,8]
[]
[null,null,null,null,null,null,null,null,null,null,"Date:",null,null,null,"Sept 12, 2017"]
[]
[]
[null,null,"Appendix 2-OA"]
[null,null,"Capital Structure and Cost of Capital"]
[]
["This table must be completed for the last Board-approved year and the test year."]
[]
[null,null,null,null,null,null,"Year:",2018]
[]
["Line No."]
[null,null,"Particulars",null,"Capitalization Ratio",null,null,null,null,null,"Cost Rate",null,null,null,"Return"]
[]
[null,null,null,null,"(%)",null,null,null,"($)",null,"(%)",null,null,null,"($)"]
[null,null,"Debt"]
[1,null,"  Long-term Debt",null,0.56000000000000005,null,null,null,{"$f":"$I$31*E22","v":22565790.240000002},null,3.7199999999999997E-2,null,null,null,{"$f":"K22*I22","v":839447.39692800003}]
[2,null,"  Short-term Debt",null,0.04,null,"(1)",null,{"$f":"$I$31*E23","v":1611842.1600000001},null,1.7600000000000001E-2,null,null,null,{"$f":"K23*I23","v":28368.422016000004}]
[3,null,"Total Debt",null,{"$f":"SUM(E22:E23)","v":0.60000000000000009},null,null,null,{"$f":"SUM(I22:I23)","v":24177632.400000002},null,{"$f":"IF(E24=0,0,SUMPRODUCT(E22:E23,K22:K23)/E24)","v":3.5893333333333326E-2},null,null,null,{"$f":"SUM(O22:O23)","v":867815.81894400006}]
[]
[null,null,"Equity"]
[4,null,"  Common Equity",null,0.4,0.4,null,null,{"$f":"$I$31*E27","v":16118421.600000001},null,8.7800000000000003E-2,null,null,null,{"$f":"K27*I27","v":1415197.4164800001}]
[5,null,"  Preferred Shares",null,null,null,null,null,{"$f":"$I$31*E28","v":0},null,null,null,null,null,{"$f":"K28*I28","v":0}]
[6,null,"Total Equity",null,{"$f":"SUM(E27:E28)","v":0.4},null,null,null,{"$f":"SUM(I27:I28)","v":16118421.600000001},null,{"$f":"IF(E29=0,0,SUMPRODUCT(E27:E28,K27:K28)/E29)","v":8.7800000000000003E-2},null,null,null,{"$f":"SUM(O27:O28)","v":1415197.4164800001}]
[]
[7,null,"Total",null,1,null,null,null,40296054,null,{"$f":"(K24*E24)+(K29*E29)","v":5.6656000000000005E-2},null,null,null,{"$f":"O24+O29","v":2283013.2354240003}]
[]
[]
["Notes"]
["(1)",null,"4.0% unless an applicant has proposed or been approved for a different amount."]

{"sheet":"App.2-OB_Debt Instruments","index":33,"n_rows":221,"n_cols":11,"rows_kept":221,"cut":false,"hidden":false,"merged":[[10,11,10,14],[12,0,12,10],[31,1,31,10],[30,1,30,10],[58,1,58,10],[59,1,59,10],[60,1,60,10],[32,1,32,10],[9,0,9,10],[10,0,10,10]]}
[null,null,null,null,null,null,null,null,null,"File Number:","2017-0038"]
[null,null,null,null,null,null,null,null,null,"Exhibit:",5]
[null,null,null,null,null,null,null,null,null,"Tab:",2]
[null,null,null,null,null,null,null,null,null,"Schedule:"]
[null,null,null,null,null,null,null,null,null,"Page:",6]
[]
[null,null,null,null,null,null,null,null,null,"Date:","Sept 12, 2017"]
[]
[]
["Appendix 2-OB"]
["Debt Instruments"]
[]
["This table must be completed for all required historical years, the bridge year and the test year."]
[null,null,null,"Year",2012]
[]
["Row","Description","Lender","Affiliated or Third-Party Debt?","Fixed or Variable-Rate?","Start Date","Term              (years)","Principal                         ($)","Rate (%) 2","Interest ($) 1","Additional Comments, if any"]
[1,"Promissory Note","Municpality of West Perth","Affiliated","Fixed Rate","2004-04-02","Demand",2083391,7.2499999999999995E-2,{"$f":"H17*I17","v":151045.8475}]
[2,"Promissory Note","Municipality of Central Elgin","Affiliated","Fixed Rate",{"$f":"F17","v":"2004-04-02"},"Demand",806436,7.2499999999999995E-2,{"$f":"H18*I18","v":58466.609999999993}]
[3,"Promissory Note","Township of East Zorra-Tavistock","Affiliated","Fixed Rate",{"$f":"F18","v":"2004-04-02"},"Demand",569073,7.2499999999999995E-2,41257.792499999996]
[4,"Promissory Note","Township of South-West Oxford","Affiliated","Fixed Rate","2004-04-02","Demand",192062,7.2499999999999995E-2,13924.494999999999]
[5,"Promissory Note","Corporation of the Town of Aylmer","Affiliated","Fixed Rate","2004-04-02","Demand",1694863,7.2499999999999995E-2,122877.56749999999]
[6,"Promissory Note","Town of Ingersoll","Affiliated","Fixed Rate","2004-04-02","Demand",3402080,7.2499999999999995E-2,246650.8]
[7,"Promissory Note","Township of Norwich","Affiliated","Fixed Rate","2004-04-02","Demand",763755,7.2499999999999995E-2,55372.237499999996]
[8,"Promissory Note","Township of Zorra","Affiliated","Fixed Rate","2004-04-02","Demand",610255,7.2499999999999995E-2,44243.487499999996]
[9,null,null,null,null,null,null,null,null,0]
[]
["Total",null,null,null,null,null,null,{"$f":"SUM(H17:H26)","v":10121915},null,{"$f":"SUM(J17:J26)","v":733838.83750000014}]
[]
["Notes"]
[]
[1,"If financing is in place only part of the year, separately calculate the pro-rated interest in the year and input in the cell."]
[2,"Input actual or deemed long-term debt rate in accordance with the guidelines in The Report of the Board on the Cost of Capital for Ontario's Regulated Utilities, issued December 11, 2009, or with any subsequent update issued by the Board."]
[3,"Add more lines above row 12 if necessary."]
[]
[]
[]
[]
[]
[]
[]
[]
[null,null,null,"Year",2013]
[]
["Row","Description","Lender","Affiliated or Third-Party Debt?","Fixed or Variable-Rate?","Start Date","Term              (years)","Principal                         ($)","Rate (%) 2","Interest ($) 1","Additional Comments, if any"]
[1,"Promissory Note","Municpality of West Perth","Affiliated","Fixed Rate","2004-04-02","Demand",2083391,7.2499999999999995E-2,{"$f":"H45*I45","v":151045.8475}]
[2,"Promissory Note","Municipality of Central Elgin","Affiliated","Fixed Rate",{"$f":"F45","v":"2004-04-02"},"Demand",806436,7.2499999999999995E-2,{"$f":"H46*I46","v":58466.609999999993}]
[3,"Promissory Note","Township of East Zorra-Tavistock","Affiliated","Fixed Rate",{"$f":"F46","v":"2004-04-02"},"Demand",569073,7.2499999999999995E-2,41257.792499999996]
[4,"Promissory Note","Township of South-West Oxford","Affiliated","Fixed Rate","2004-04-02","Demand",192062,7.2499999999999995E-2,13924.494999999999]
[5,"Promissory Note","Corporation of the Town of Aylmer","Affiliated","Fixed Rate","2004-04-02","Demand",1694863,7.2499999999999995E-2,122877.56749999999]
[6,"Promissory Note","Town of Ingersoll","Affiliated","Fixed Rate","2004-04-02","Demand",3402080,7.2499999999999995E-2,246650.8]
[7,"Promissory Note","Township of Norwich","Affiliated","Fixed Rate","2004-04-02","Demand",763755,7.2499999999999995E-2,55372.237499999996]
[8,"Promissory Note","Township of Zorra","Affiliated","Fixed Rate","2004-04-02","Demand",610255,7.2499999999999995E-2,44243.487499999996]
[12,null,null,null,null,null,null,null,null,0]
[]
["Total",null,null,null,null,null,null,{"$f":"SUM(H45:H54)","v":10121915},null,{"$f":"SUM(J45:J54)","v":733838.83750000014}]
[]
["Notes"]
[]
[1,"If financing is in place only part of the year, separately calculate the pro-rated interest in the year and input in the cell."]
[2,"Input actual or deemed long-term debt rate in accordance with the guidelines in The Report of the Board on the Cost of Capital for Ontario's Regulated Utilities, issued December 11, 2009, or with any subsequent update issued by the Board."]
[3,"Add more lines above row 12 if necessary."]
[]
[]
[]
[]
[]
[]
[]
[]
[]
[]
[]
[]
[null,null,null,"Year",2014]
[]
["Row","Description","Lender","Affiliated or Third-Party Debt?","Fixed or Variable-Rate?","Start Date","Term              (years)","Principal                         ($)","Rate (%) 2","Interest ($) 1","Additional Comments, if any"]
[1]
[2,"Promissory Note","Municpality of West Perth","Affiliated","Fixed Rate","2004-04-02","Demand",2083391,7.2499999999999995E-2,{"$f":"H78*I78","v":151045.8475}]
[3,"Promissory Note","Municipality of Central Elgin","Affiliated","Fixed Rate",{"$f":"F78","v":"2004-04-02"},"Demand",806436,7.2499999999999995E-2,{"$f":"H79*I79","v":58466.609999999993}]
[4,"Promissory Note","Township of East Zorra-Tavistock","Affiliated","Fixed Rate",{"$f":"F79","v":"2004-04-02"},"Demand",569073,7.2499999999999995E-2,41257.792499999996]
[5,"Promissory Note","Township of South-West Oxford","Affiliated","Fixed Rate","2004-04-02","Demand",192062,7.2499999999999995E-2,13924.494999999999]
[6,"Promissory Note","Corporation of the Town of Aylmer","Affiliated","Fixed Rate","2004-04-02","Demand",1694863,7.2499999999999995E-2,122877.56749999999]
[7,"Promissory Note","Town of Ingersoll","Affiliated","Fixed Rate","2004-04-02","Demand",3402080,7.2499999999999995E-2,246650.8]
[8,"Promissory Note","Township of Norwich","Affiliated","Fixed Rate","2004-04-02","Demand",763755,7.2499999999999995E-2,55372.237499999996]
[12,"Promissory Note","Township of Zorra","Affiliated","Fixed Rate","2004-04-02","Demand",610255,7.2499999999999995E-2,44243.487499999996]
[null,null,null,null,null,null,null,null,null,0]
["Total"]
[null,null,null,null,null,null,null,{"$f":"SUM(H78:H87)","v":10121915},null,{"$f":"SUM(J78:J87)","v":733838.83750000014}]
["Notes"]
[]
[1,"If financing is in place only part of the year, separately calculate the pro-rated interest in the year and input in the cell."]
[2,"Input actual or deemed long-term debt rate in accordance with the guidelines in The Report of the Board on the Cost of Capital for Ontario's Regulated Utilities, issued December 11, 2009, or with any subsequent update issued by the Board."]
[3,"Add more lines above row 12 if necessary."]
[]
[]
[]
[]
[]
[]
[]
[]
[]
[]
[]
[]
[]
[]
[]
[]
[]
[]
[]
[]
[]
[]
[null,null,null,"Year",2015]
[]
["Row","Description","Lender","Affiliated or Third-Party Debt?","Fixed or Variable-Rate?","Start Date","Term              (years)","Principal                         ($)","Rate (%) 2","Interest ($) 1"]
[1,"Promissory Note","Town of Ingersol","Affiliated","Fixed","2004-04-02","Demand",3402080,7.2499999999999995E-2,246650.8,"Additional Comments, if any"]
[2,"Promissory Note","Municipality of Central Elgin","Affiliated","Fixed",{"$f":"F119","v":"2004-04-02"},"Demand",806436,7.2499999999999995E-2,58466.609999999993]
[3,"Promissory Note","Township of East Zorra Tavistock","Affiliated","Fixed",{"$f":"F120","v":"2004-04-02"},"Demand",569073,7.2499999999999995E-2,41257.792499999996]
[4,"Promissory Note","Township of Southwest Oxford","Affiliated","Fixed","2004-04-02","Demand",192062,7.2499999999999995E-2,13924.494999999999]
[5,"Promissory Note","Town of Aylmer","Affiliated","Fixed","2004-04-02","Demand",1694863,7.2499999999999995E-2,122877.56749999999]
[6,"Promissory Note","Township of Zorra","Affiliated","Fixed","2004-04-02","Demand",610255,7.2499999999999995E-2,44243.487499999996]
[7,"Promissory Note","Township of Norwich","Affiliated","Fixed","2004-04-02","Demand",763755,7.2499999999999995E-2,55372.237499999996]
[8,"Promissory Note","Municpality of West Perth","Affiliated","Fixed","2004-04-02","Demand",2083391,7.2499999999999995E-2,151045.8475]
[9,"Promissory Note","ERTH Corporation","Affiliated","Fixed","12-31-2015","NA",10000000,2.5000000000000001E-2,250000]
[10]
[11,null,null,null,null,null,null,null,null,0]
[12,null,null,null,null,null,null,null,null,0]
[]
["Total",null,null,null,null,null,null,{"$f":"SUM(H119:H131)","v":20121915},null,{"$f":"SUM(J119:J131)","v":983838.83750000002}]
[]
["Notes"]
[]
[1,"If financing is in place only part of the year, separately calculate the pro-rated interest in the year and input in the cell."]
[2,"Input actual or deemed long-term debt rate in accordance with the guidelines in The Report of the Board on the Cost of Capital for Ontario's Regulated Utilities, issued December 11, 2009, or with any subsequent update issued by the Board."]
[3,"Add more lines above row 12 if necessary."]
[]
[]
[]
[]
[]
[]
[]
[null,null,null,"Year",2016]
[]
["Row","Description","Lender","Affiliated or Third-Party Debt?","Fixed or Variable-Rate?","Start Date","Term              (years)","Principal                         ($)","Rate (%) 2","Interest ($) 1"]
[1,"Promissory Note","Town of Ingersol","Affiliated","Fixed","2004-04-02","Demand",3402080,7.2499999999999995E-2,246650.8,"Additional Comments, if any"]
[2,"Promissory Note","Municipality of Central Elgin","Affiliated","Fixed",{"$f":"F149","v":"2004-04-02"},"Demand",806436,7.2499999999999995E-2,58466.609999999993]
[3,"Promissory Note","Township of East Zorra Tavistock","Affiliated","Fixed",{"$f":"F150","v":"2004-04-02"},"Demand",569073,7.2499999999999995E-2,41257.792499999996]
[4,"Promissory Note","Township of Southwest Oxford","Affiliated","Fixed","2004-04-02","Demand",192062,7.2499999999999995E-2,13924.494999999999]
[5,"Promissory Note","Town of Aylmer","Affiliated","Fixed","2004-04-02","Demand",1694863,7.2499999999999995E-2,122877.56749999999]
[6,"Promissory Note","Township of Zorra","Affiliated","Fixed","2004-04-02","Demand",610255,7.2499999999999995E-2,44243.487499999996]
[7,"Promissory Note","Township of Norwich","Affiliated","Fixed","2004-04-02","Demand",763755,7.2499999999999995E-2,55372.237499999996]
[8,"Promissory Note","Municpality of West Perth","Affiliated","Fixed","2004-04-02","Demand",2083391,7.2499999999999995E-2,151045.8475]
[9,"Promissory Note","ERTH Corporation","Affiliated","Fixed","12-31-2015","NA",10000000,2.5000000000000001E-2,250000]
[11]
[12]
[]
["Total",null,null,null,null,null,null,{"$f":"SUM(H149:H160)","v":20121915},null,{"$f":"SUM(J149:J160)","v":983838.83750000002}]
[]
["Notes"]
[]
[1,"If financing is in place only part of the year, separately calculate the pro-rated interest in the year and input in the cell."]
[2,"Input actual or deemed long-term debt rate in accordance with the guidelines in The Report of the Board on the Cost of Capital for Ontario's Regulated Utilities, issued December 11, 2009, or with any subsequent update issued by the Board."]
[3,"Add more lines above row 12 if necessary."]
[]
[]
[]
[]
[null,null,null,"Year",2017]
[]
["Row","Description","Lender","Affiliated or Third-Party Debt?","Fixed or Variable-Rate?","Start Date","Term              (years)","Principal                         ($)","Rate (%) 2","Interest ($) 1","Additional Comments, if any"]
[1,"Promissory Note","Town of Ingersol","Affiliated","Fixed","2004-04-02","Demand",3402080,7.2499999999999995E-2,246650.8]
[2,"Promissory Note","Municipality of Central Elgin","Affiliated","Fixed",{"$f":"F175","v":"2004-04-02"},"Demand",806436,7.2499999999999995E-2,58466.609999999993]
[3,"Promissory Note","Township of East Zorra Tavistock","Affiliated","Fixed",{"$f":"F176","v":"2004-04-02"},"Demand",569073,7.2499999999999995E-2,41257.792499999996]
[4,"Promissory Note","Township of Southwest Oxford","Affiliated","Fixed","2004-04-02","Demand",192062,7.2499999999999995E-2,13924.494999999999]
[5,"Promissory Note","Town of Aylmer","Affiliated","Fixed","2004-04-02","Demand",1694863,7.2499999999999995E-2,122877.56749999999]
[6,"Promissory Note","Township of Zorra","Affiliated","Fixed","2004-04-02","Demand",610255,7.2499999999999995E-2,44243.487499999996]
[7,"Promissory Note","Township of Norwich","Affiliated","Fixed","2004-04-02","Demand",763755,7.2499999999999995E-2,55372.237499999996]
[8,"Promissory Note","Municpality of West Perth","Affiliated","Fixed","2004-04-02","Demand",2083391,7.2499999999999995E-2,151045.8475]
[9,"Promissory Note","ERTH Corporation","Affiliated","Fixed","12-31-2015","NA",10000000,2.5000000000000001E-2,250000]
[10,"Promissory Note","ERTH Corporation","Affiliated","Fixed","12-31-2017","NA",1650000,2.5000000000000001E-2,41250]
[11]
[]
["Total",null,null,null,null,null,null,{"$f":"SUM(H175:H186)","v":21771915},null,{"$f":"SUM(J175:J186)","v":1025088.8375}]
[]
["Notes"]
[]
[1,"If financing is in place only part of the year, separately calculate the pro-rated interest in the year and input in the cell."]
[2,"Input actual or deemed long-term debt rate in accordance with the guidelines in The Report of the Board on the Cost of Capital for Ontario's Regulated Utilities, issued December 11, 2009, or with any subsequent update issued by the Board."]
[3,"Add more lines above row 12 if necessary."]
[]
[]
[]
[]
[]
[]
[null,null,null,"Year",2018]
[]
["Row","Description","Lender","Affiliated or Third-Party Debt?","Fixed or Variable-Rate?","Start Date","Term              (years)","Principal                         ($)","Rate (%) 2","Interest ($) 1","Additional Comments, if any"]
[1,"Promissory Note","Town of Ingersol","Affiliated","Fixed","2004-04-02","Demand",3402080,7.2499999999999995E-2,246650.8]
[2,"Promissory Note","Municipality of Central Elgin","Affiliated","Fixed",{"$f":"F203","v":"2004-04-02"},"Demand",806436,7.2499999999999995E-2,58466.609999999993]
[3,"Promissory Note","Township of East Zorra Tavistock","Affiliated","Fixed",{"$f":"F204","v":"2004-04-02"},"Demand",569073,7.2499999999999995E-2,41257.792499999996]
[4,"Promissory Note","Township of Southwest Oxford","Affiliated","Fixed","2004-04-02","Demand",192062,7.2499999999999995E-2,13924.494999999999]
[5,"Promissory Note","Town of Aylmer","Affiliated","Fixed","2004-04-02","Demand",1694863,7.2499999999999995E-2,122877.56749999999]
[6,"Promissory Note","Township of Zorra","Affiliated","Fixed","2004-04-02","Demand",610255,7.2499999999999995E-2,44243.487499999996]
[7,"Promissory Note","Township of Norwich","Affiliated","Fixed","2004-04-02","Demand",763755,7.2499999999999995E-2,55372.237499999996]
[8,"Promissory Note","Municpality of West Perth","Affiliated","Fixed","2004-04-02","Demand",2083391,7.2499999999999995E-2,151045.8475]
[9,"Promissory Note","ERTH Corporation","Affiliated","Fixed","12-31-2015","NA",10000000,2.5000000000000001E-2,250000]
[10,"Promissory Note","ERTH Corporation","Affiliated","Fixed","12-31-2017","NA",1650000,2.5000000000000001E-2,41250]
[11,"Promissory Note","ERTH Corporation","Affiliated","Fixed","12-31-2018","NA",1750000,2.5000000000000001E-2,43750]
[]
["Total",null,null,null,null,null,null,{"$f":"SUM(H203:H214)","v":23521915},null,{"$f":"SUM(J203:J214)","v":1068838.8374999999}]
[]
["Notes"]
[]
[1,"If financing is in place only part of the year, separately calculate the pro-rated interest in the year and input in the cell."]
[2,"Input actual or deemed long-term debt rate in accordance with the guidelines in The Report of the Board on the Cost of Capital for Ontario's Regulated Utilities, issued December 11, 2009, or with any subsequent update issued by the Board."]
[3,"Add more lines above row 12 if necessary."]

{"sheet":"App.2-Q_Cost of Serv. Emb. Dx","index":34,"n_rows":60,"n_cols":7,"rows_kept":60,"cut":false,"hidden":false,"merged":[[9,7,9,11],[12,0,12,6],[11,0,11,6],[58,3,59,3],[58,4,59,4],[53,4,54,4],[8,0,8,6],[9,0,9,6],[15,0,15,1],[15,2,15,3],[53,3,54,3]]}
[null,null,null,null,null,"File Number:",{"$f":"EBNUMBER","v":"EB-2017-0038"}]
[null,null,null,null,null,"Exhibit:"]
[null,null,null,null,null,"Tab:"]
[null,null,null,null,null,"Schedule:"]
[null,null,null,null,null,"Page:"]
[]
[null,null,null,null,null,"Date:"]
[]
["Appendix 2-Q"]
["Cost of Serving Embedded Distributor(s) "]
[]
["To be completed by Host Distributors ONLY"]
["(Not required if Host Distributor has an Embedded Distributor rate class, i.e. a separate row on Sheet 11 of the RRWF.)"]
[]
[]
["Proposed Rate Class for Billing Embedded Distributor(s)",null,"Hydro One Neworks"]
[]
["Host's Distribution Facilities used by Embedded Distributor(s)"]
[]
["(1)","(2)","(3)","(4)","(5)","(6) = '(3) + (4)"]
["Asset Class","Total OM&A costs asociated with asset class ","Original cost of asset class ","Accumulated amortization of asset class","Annual amortization of asset class","Net Book Value of asset class"]
["Totals for Host Distributor:","($)","($)","($)","($)"]
["Distribution Stations",null,null,null,null,{"$f":"C23+D23","v":0}]
["Low Voltage Line",null,null,null,null,0]
["LV Line category # 2 (if applcable)",null,null,null,null,0]
["TS (owned by host)",null,null,null,null,0]
["add rows if necessary... ",null,null,null,null,0]
[null,null,null,null,null,0]
[null,null,null,null,null,0]
[]
["(1)","(7)","(8)","(9)","(10)","(11)"]
[{"$f":"A21","v":"Asset Class"},"Total line length or station capacity in asset class","Line length or capacity required to provide LV service to Embedded Distributor(s)","Annual total demand on station/line providing LV services (sum of 12 monthly peaks)","Annual billed Embedded Distributor demand on station/line providing LV services","Embedded Distributor(s)' Responsibility Share "]
["Embedded Distributor's share:","kW or kVa; km","kW or kVA; km","kW or kVA","kW or kVA","percent"]
["Distribution Stations",null,null,null,null,{"$f":"IF(D34=0,0,(C34/B34)*(E34/D34))","v":0}]
["Low Voltage Line",null,null,null,null,{"$f":"IF(D35=0,0,(C35/B35)*(E35/D35))","v":0}]
["LV Line # 2 (if applicable) ",null,null,null,null,{"$f":"IF(D36=0,0,(C36/B36)*(E36/D36))","v":0}]
["TS (owned by host)",null,null,null,null,{"$f":"IF(D37=0,0,(C37/B37)*(E37/D37))","v":0}]
["add rows if necessary ",null,null,null,null,{"$f":"IF(D38=0,0,(C38/B38)*(E38/D38))","v":0}]
[]
["(1)","(12)","(12a)","(13)","(14)","(15)","(16)"]
[{"$f":"A32","v":"Asset Class"},"Return on Assets used to Provide LV services","Taxes/PILs","Annual amortization on assets used to provide LV services","OM&A costs with burden associated with assets used to provide LV services","Total annual cost associated with assets used to provide LV services","Monthly cost associated with the delivery of LV services"]
[null,"($)","($)","($)","($)","($)","$/kW or $/kVA"]
["Distribution Stations",{"$f":"E$54*(F23+B23*E$59)*F34","v":0},{"$f":"(B43-(B$54*C$54*F34*(F23+B23*E57)+B$55*C$55*F34*(F23+B23*E$57)))*E$57/(1-E$57)","v":0},{"$f":"E23*F34","v":0},{"$f":"B23*F34","v":0},{"$f":"SUM(B43:E43)","v":0},{"$f":"IF(E34=0,0,(D43/E34))","v":0}]
["Low Voltage Line",{"$f":"E$54*(F24+B24*E$59)*F35","v":0},{"$f":"(B44-(B$54*C$54*F35*(F24+B24*E58)+B$55*C$55*F35*(F24+B24*E58)))*E$57/(1-E$57)","v":0},{"$f":"E24*F35","v":0},{"$f":"B24*F35","v":0},{"$f":"SUM(B44:E44)","v":0},{"$f":"IF(E35=0,0,(D44/E35))","v":0}]
["LV Line # 2 (if applicable) ",{"$f":"E$54*(F25+B25*E$59)*F36","v":0},{"$f":"(B45-(B$54*C$54*F36*(F25+B25*E59)+B$55*C$55*F36*(F25+B25*E$59)))*E$57/(1-E$57)","v":0},{"$f":"E25*F36","v":0},{"$f":"B25*F36","v":0},{"$f":"SUM(B45:E45)","v":0},{"$f":"IF(E36=0,0,(D45/E36))","v":0}]
["TS (owned by host)",{"$f":"E$54*(F26+B26*E$59)*F37","v":0},{"$f":"(B46-(B$54*C$54*F37*(F26+B26*E60)+B$55*C$55*F37*(F26+B26*E60)))*E$57/(1-E$57)","v":0},{"$f":"E26*F37","v":0},{"$f":"B26*F37","v":0},{"$f":"SUM(B46:E46)","v":0},{"$f":"IF(E37=0,0,(D46/E37))","v":0}]
["add rows if necessary ",{"$f":"E$54*(F27+B27*E$59)*F38","v":0},{"$f":"(B47-(B$54*C$54*F38*(F27+B27*I61)+B$55*C$55*F38*(F27+B27*I61)))*E$57/(1-E$57)","v":0},{"$f":"E27*F38","v":0},{"$f":"B27*F38","v":0},{"$f":"SUM(B47:E47)","v":0},{"$f":"IF(E38=0,0,(D47/E38))","v":0}]
[]
["Total",null,null,null,null,{"$f":"SUM(F43:F47)","v":0},{"$f":"SUM(G43:G47)","v":0}]
[]
["(17)","(18)","(19)","(20)","(21)"]
[null,"Capital Structure","Cost Rate"]
[null,"(%)","(%)",null,"(%)"]
["Long-Term Debt",null,null,"Weighted Average Cost of Capital",{"$f":"IF(B60=0%,0,SUMPRODUCT(B54:B58,C54:C58)/B60)","v":0}]
["Short-term Debt"]
[]
["Common Equity",null,null,"Tax/PILs Rate"]
["Preferred Shares"]
[null,null,null,"Working Capital Allowance Factor"]
["Total",{"$f":"SUM(B54:B58)","v":0}]

{"sheet":"App.2-R_Loss Factors","index":35,"n_rows":70,"n_cols":9,"rows_kept":70,"cut":false,"hidden":false,"merged":[[55,2,56,8],[58,2,58,8],[30,2,32,8],[68,2,68,8],[60,2,60,8],[62,2,62,8],[64,2,66,7],[50,2,50,8],[14,2,14,8],[23,2,23,8],[25,2,25,8],[52,2,53,8],[34,2,37,8],[41,2,43,8],[45,2,48,8],[8,1,8,8],[9,1,9,8],[10,1,10,8],[12,1,13,2],[12,3,12,7],[12,8,13,8]]}
[null,null,null,null,null,null,null,"File Number:",{"$f":"EBNUMBER","v":"EB-2017-0038"}]
[null,null,null,null,null,null,null,"Exhibit:",8]
[null,null,null,null,null,null,null,"Tab:",10]
[null,null,null,null,null,null,null,"Schedule:"]
[null,null,null,null,null,null,null,"Page:",22]
[]
[null,null,null,null,null,null,null,"Date:","Sept 12, 2017"]
[]
[null,"Appendix 2-R"]
[null,"Loss Factors"]
[]
[]
[null,null,null,"Historical Years",null,null,null,null,"5-Year Average"]
[null,null,null,{"$f":"IF(ISBLANK('LDC Info'!E26-5), \"Year 5\", 'LDC Info'!E26-5)","v":2012},{"$f":"IF(ISBLANK('LDC Info'!E26-4), \"Year 5\", 'LDC Info'!E26-4)","v":2013},{"$f":"IF(ISBLANK('LDC Info'!E26-3), \"Year 5\", 'LDC Info'!E26-3)","v":2014},{"$f":"IF(ISBLANK('LDC Info'!E26-2), \"Year 5\", 'LDC Info'!E26-2)","v":2015},{"$f":"IF(ISBLANK('LDC Info'!E26-1), \"Year 5\", 'LDC Info'!E26-1)","v":2016}]
[null,null,"Losses Within Distributor's System"]
[null,"A(1)","\"Wholesale\" kWh delivered to distributor (higher value)",519210744,515637181,517768926,507413805,505984242,{"$f":"IF(SUM(D16:H16)=0,0,AVERAGE(D16:H16))","v":513202979.60000002}]
[null,"A(2)","\"Wholesale\" kWh delivered to distributor (lower value)",503695426,501163004,503362732,493276488,491478821,{"$f":"IF(SUM(D17:H17)=0,0,AVERAGE(D17:H17))","v":498595294.19999999}]
[null,"B","Portion of \"Wholesale\" kWh delivered to distributor for its Large Use Customer(s)",94151552,95115541,98447966,100676057,108025610,{"$f":"IF(SUM(D18:H18)=0,0,AVERAGE(D18:H18))","v":99283345.200000003}]
[null,"C","Net \"Wholesale\" kWh delivered to distributor  = A(2) - B",{"$f":"D17-D18","v":409543874},406047463,404914766,392600431,383453211,399311949]
[null,"D","\"Retail\" kWh delivered by distributor",490774734.69999999,495448451.89999998,490252582,486409128,478271195,{"$f":"IF(SUM(D20:H20)=0,0,AVERAGE(D20:H20))","v":488231218.31999999}]
[null,"E","Portion of \"Retail\" kWh delivered by distributor to its Large Use Customer(s)",94575234,95686234,99038654,101280110,108673764,{"$f":"IF(SUM(D21:H21)=0,0,AVERAGE(D21:H21))","v":99850799.200000003}]
[null,"F","Net \"Retail\" kWh delivered by distributor = D - E",{"$f":"D20-D21","v":396199500.69999999},399762217.89999998,391213928,385129018,369597431,388380419.12]
[null,"G","Loss Factor in Distributor's system = C / F",{"$f":"IF(D22=0,\"\",D19/D22)","v":1.0336809442627346},1.0157224590483243,1.0350213451500632,1.0193997664439816,1.0374888428269404,1.0281464495681036]
[null,null,"Losses Upstream of Distributor's System"]
[null,"H","Supply Facilities Loss Factor",1.004494806376657,1.0042461019016489,1.0042069438762147,1.00419006432797,1.0041696034437373,{"$f":"IF(SUM(D25:H25)=0,0,AVERAGE(D25:H25))","v":1.0042615039852456}]
[null,null,"Total Losses"]
[null,"I","Total Loss Factor = G x H",{"$f":"IF(D23=\"\",\"\",D23*D25)","v":1.0383271399624356},1.0200353201132368,1.0393756218597936,1.0236711170412993,1.0418147598788308,1.0325278997603542]
[]
[null,"Notes:"]
[]
[null,"A(1)","If directly connected to the IESO-controlled grid, kWh pertains to the virtual meter on the primary or high voltage side of the transformer at the interface with the transmission grid.  This corresponds to the \"With Losses\" kWh value provided by the IESO's MV-WEB.  It is the higher of the two values provided by MV-WEB."]
[]
[]
[]
[null,null,"If fully embedded within a host distributor, kWh pertains to the virtual meter on the primary or high voltage side of the transformer, at the interface between the host distributor and the transmission grid.  For example, if the host distributor is Hydro One Networks Inc., kWh from the Hydro One Networks' invoice corresponding to \"Total kWh w Losses\" should be reported.  This corresponds to the higher of the two kWh values provided in Hydro One Networks' invoice."]
[]
[]
[]
[]
[null,null,"If partially embedded, kWh pertains to the sum of the above."]
[]
[null,"A(2)","If directly connected to the IESO-controlled grid, kWh pertains to a metering installation on the secondary or low voltage side of the transformer at the interface with the transmission grid.  This corresponds to the \"Without Losses\" kWh value provided by the IESO's MV-WEB.  It is the lower of the two kWh values provided by MV-WEB."]
[]
[]
[]
[null,null,"If fully embedded with the host distributor, kWh pertains to a metering installation on the secondary or low voltage side of the transformer at the interface between the embedded distributor and the host distributor.  For example, if the host distributor is Hydro One Networks Inc., kWh from the Hydro One Networks' invoice corresponding to \"Total kWh\" should be reported.  This corresponds to the lower of the two kWh values provided in Hydro One Networks' invoice."]
[]
[]
[]
[]
[null,null,"If partially embedded, kWh pertains to the sum of the above."]
[]
[null,null,"Additionally, kWh pertaining to distributed generation directly connected to the distributor's own distribution network should be included in A(2)."]
[]
[]
[null,"B","If a Large Use Customer is metered on the secondary or low voltage side of the transformer, the default loss is 1%                         (i.e., B = 1.01 X E)."]
[]
[]
[null,"D","kWh corresponding to D should equal metered or estimated kWh at the customer’s delivery point."]
[]
[null,"G and I","These loss factors pertain to secondary-metered customers with demand less than 5,000 kW."]
[]
[null,"H","If directly connected to the IESO-controlled grid, SFLF = 1.0045."]
[]
[null,null,"If fully embedded within a host distributor, SFLF = loss factor re losses in transformer at grid interface X loss factor re losses in host distributor's system.  If the host distributor is Hydro One Networks Inc., SFLF = 1.0060 X 1.0278 = 1.0340. If partially embedded, SFLF should be calculated as the weighted average of above."]
[]
[]
[]
[null,null,"Distributors that wish to propose a different SFLF should provide appropriate justification for any such proposal including supporting"]
[null,null,"calculations and any other relevant material."]

{"sheet":"App.2-S_Stranded Meters","index":36,"n_rows":93,"n_cols":8,"rows_kept":93,"cut":false,"hidden":false,"merged":[[8,0,8,7],[9,0,9,7],[30,0,33,7],[35,0,36,7],[55,2,56,7],[63,2,65,7],[67,0,68,7],[38,1,39,7],[41,1,43,7],[45,1,48,7],[50,1,53,7],[58,2,61,7],[92,0,95,7],[85,1,87,7],[89,1,90,7],[70,1,71,7],[77,1,79,7],[81,1,83,7],[73,1,75,7]]}
[null,null,null,null,null,null,"File Number:",{"$f":"EBNUMBER","v":"EB-2017-0038"}]
[null,null,null,null,null,null,"Exhibit:"]
[null,null,null,null,null,null,"Tab:"]
[null,null,null,null,null,null,"Schedule:"]
[null,null,null,null,null,null,"Page:"]
[]
[null,null,null,null,null,null,"Date:"]
[]
["Appendix 2-S"]
["Stranded Meter Treatment"]
[]
["Year","Notes","Gross Asset Value","Accumulated Amortization","Contributed Capital (Net of Amortization)","Net Asset","Proceeds on Disposition","Residual Net Book Value"]
[null,null,"(A)","(B)","(C)","(D ) = (A) - (B) - (C)","(E)","(F) = (D) - (E)"]
[2006]
[2007]
[2008]
[2009]
[2010]
[2011]
[2012]
[2013]
[2014]
[2015]
[2016]
[2017,"(1)",null,null,null,{"$f":"C25-D25-E25","v":0},null,{"$f":"F25-G25","v":0}]
[]
["Notes:"]
[]
["(1)","For 2017, please indicate whether the amounts provided are on a forecast or actual basis."]
[]
["Some distributors have transferred the cost of stranded meters from Account 1860 - Meters to \"Sub-account Stranded Meter Costs of Account 1555\", while in some cases distributors have left these costs in Account 1860.  Depending on which treatment the applicant has chosen. please provide the information under either of the two scenarios (A and B below), as applicable."]
[]
[]
[]
[]
["Scenario A:  If the stranded meter costs were transferred to \"Sub-account Stranded Meter Costs\" of Account 1555, the above table should be completed and the following information should be provided in Exhibit 9."]
[]
[]
[1,"A description of the accounting treatment followed by the applicant on stranded meter costs for financial accounting and reporting purposes."]
[]
[]
[2,"The amount of the pooled residual net book value of the removed from service stranded meters, less any contributed capital (net of accumulated amortization), and less any net proceeds from sales, which were transferred to this sub-account as of December 31, 2010."]
[]
[]
[]
[3,"A statement as to whether or not, since transferring the removed stranded meter costs to the sub-account, the recording of depreciation expenses was continued in order to reduce the net book value through accumulated depreciation.  If so, the total depreciation expense amount for the period from the time the costs for the stranded meters were transferred to the sub-account to December 31, 2010 should be provided."]
[]
[]
[]
[]
[null,"If no depreciation expenses were recorded to reduce the net book value of stranded meter costs through accumulated depreciation, the total depreciation expense amount that would have been applicable from the time that the stranded meter costs were transferred to the sub-account of Account 1555 to December 31, 2010 should be provided.  In addition, the following information should be provided:"]
[]
[]
[]
[]
[null,"a)","Whether or not carrying charges were recorded for the stranded meter cost balances in the sub-account, and if so, the total carrying charges recorded to December 31, 2010."]
[]
[]
[null,"b)","The estimated amount of the pooled residual net book value of the removed from service meters, less any net proceeds from sales and contributed capital, at the time when the smart meters will have been fully deployed (e.g., as of December 31, 2010).  If the smart meters have been fully deployed, the actual amount should be provided."]
[]
[]
[]
[]
[null,"c)","A description as to how the applicant intends to recover in rates the remaining costs for stranded meters, including the proposed accounting treatment, the proposed disposition period, and the associated bill impacts."]
[]
[]
[]
["Scenario B:  If the stranded meter costs remained recorded in Account 1860, the above table should be completed and the following information should be provided in Exhibit 9:"]
[]
[]
[1,"A description of the accounting treatment followed by the applicant on stranded meter costs for financial accounting and reporting purposes."]
[]
[]
[2,"The amount of the pooled residual net book value of the removed from service stranded meters, less any contributed capital (net of accumulated amortization), and less any net proceeds from sales, as of December 31, 2010."]
[]
[]
[]
[3,"A statement as to whether or not the recording of depreciation expenses continued in order to reduce the net book value through accumulated depreciation.  If so, provision of the total (cumulative) depreciation expense for the period from the time that the meters became stranded to December 31, 2010."]
[]
[]
[]
[4,"If no depreciation expenses were recorded to reduce the net book value of stranded meters through accumulated depreciation, the total (cumulative) depreciation expense amount that would have been applicable for the period from the time that the meters became stranded to December 31, 2010."]
[]
[]
[]
[5,"The estimated amount of the pooled residual net book value of the removed from service meters, less any net proceeds from sales and contributed capital, at the time when smart meters will have been fully deployed.  If the smart meters have been fully deployed, please provide the actual amount."]
[]
[]
[]
[6,"A description as to how the applicant intends to recover in rates the costs for stranded meters, including the proposed accounting treatment, the proposed disposition period and the associated bill impacts."]
[]
[]
["Distributors should also provide the Net Book Value per class of meter as of December 31, 2010 as well as the number of meters that were removed / stranded.  In preparing this information, distributors should review the Board's letter of January 16, 2007 Stranded Meter Costs Related to the Installation of Smart Meters which stated that records were to be kept of the type and number of each meter to support the stranded meter costs."]

{"sheet":"App.2-Y_MIFRS Summary Impacts","index":37,"n_rows":37,"n_cols":9,"rows_kept":37,"cut":false,"hidden":false,"merged":[[31,6,31,8],[32,0,32,2],[32,6,32,8],[8,0,8,8],[9,0,9,8],[10,0,10,8],[14,0,16,2],[14,6,14,8],[15,6,15,8],[17,0,17,2],[17,6,17,8],[18,0,18,2],[18,6,18,8],[19,0,19,2],[19,6,19,8],[20,0,20,2],[20,6,20,8],[21,0,21,2],[21,6,21,8],[22,0,22,2],[22,3,22,5],[22,6,22,8],[23,0,23,2],[23,6,23,8],[24,0,24,2],[24,6,24,8],[25,0,25,2],[25,6,25,8],[36,0,36,8],[29,0,29,2],[29,6,29,8],[30,0,30,2],[26,0,26,2],[26,6,26,8],[27,0,27,2],[27,6,27,8],[28,0,28,2],[28,6,28,8],[33,0,33,2],[33,6,33,8],[34,0,34,2],[34,6,34,8],[30,6,30,8],[31,0,31,2]]}
[null,null,null,null,null,null,null,"File Number:",{"$f":"EBNUMBER","v":"EB-2017-0038"}]
[null,null,null,null,null,null,null,"Exhibit:"]
[null,null,null,null,null,null,null,"Tab:"]
[null,null,null,null,null,null,null,"Schedule:"]
[null,null,null,null,null,null,null,"Page:"]
[]
[null,null,null,null,null,null,null,"Date:","Sept 12, 2017"]
[]
["Appendix 2-Y"]
["Summary of Impacts to Revenue Requirement"]
["from Transition to MIFRS"]
[]
[]
[]
["Revenue Requirement Component",null,null,2018,2018,"Difference","Reasons why the revenue requirement "]
[null,null,null,"MIFRS","CGAAP 1",null,"component is different under MIFRS"]
[]
["Closing NBV 2017",null,null,34442729.388365857,33439984.59,1002744.7983658575,"Change in amortization and capitalization policy"]
["Closing NBV 2018",null,null,35842899.607484065,34248598.829999998,1594300.7774840668,"Change in amortization and capitalization policy"]
["Average NBV",null,null,35142814.497924961,33844291.710000001,1298522.7879249603]
["Working Capital",null,null,68709864.207928523,68709864.207928523,0]
["Rate Base",null,null,103852678.70585349,102554155.91792852,1298522.7879249752]
[null,null,null,null,null,0]
["Return on Rate Base",null,null,null,null,0]
[null,null,null,null,null,0]
["OM&A",null,null,6456769.3561483491,6149422.3561483491,307347,"Change in Capitalization Policy"]
["Depreciation",null,null,2573154.4664175184,3086698.05,-513543.58358248137,"Change to IFRS amortization Rates"]
["PILs or Income Taxes",null,null,null,null,0]
[null,null,null,null,null,0]
["Less: Revenue Offsets",null,null,null,null,0]
[null,null,null,null,null,0]
[null,null,null,null,null,0]
[null,null,null,null,null,0]
["Insert description of additional item(s) and new rows if needed.",null,null,null,null,0]
["Total Base Revenue Requirement",null,null,9029923.8225658685,9236120.406148348,-206196.58358248137]
[]
["1.  Applicants must provide a summary of the dollar impacts of MIFRS to each component of the revenue requirement (e.g. rate base, operating costs, etc.), including the overall impact on the proposed revenue requirement.  Accordingly, the applicants must identify financial differences and resulting revenue requirement impacts arising from the adoption of  MIFRS as compared to CGAAP.  If the applicant is reflecting the changes in capitalization and depreciation policies for the first time in a rebasing application, then the comparison in the above table should be between MIFRS and CGAAP before the change in accounting policies. If the applicant changed capitalization and depreciation policies and reflected these changes in a previous rebasing application, the comparison in the above table should be between MIFRS and CGAAP after the change in accounting policies.  "]

{"sheet":"Sheet19","index":38,"n_rows":72,"n_cols":9,"rows_kept":72,"cut":false,"hidden":true,"merged":[]}
[null,"CGAAP","CGAAP","CGAAP","MIFRS","USGAAP","ASPE","ASPE","ASPE"]
[null,"N/A",2012,2013,null,null,"N/A",2012,2013]
["LDC Info","x","x","x","x","x","x","x","x"]
["Table of Contents","x","x","x","x","x","x","x","x"]
["COS Flowchart","x","x","x","x","x","x","x","x"]
["List of Key References","x","x","x","x","x","x","x","x"]
["App.2-AA_Capital Projects","x","x","x","x","x","x","x","x"]
["App.2-AB_Capital Expenditures","x","x","x","x","x","x","x","x"]
["App.2-BA1_Fix Asset Cont.CGAAP","x","x","x","n","x","x","x","x"]
["App.2-BA2_Fix Asset Cont.MIFRS","n","n","n","x","n","n","n","n"]
["Appendix 2-BB Service Life Comp","x","x","x","x","x","x","x","x"]
["Instruction for App. 2-C MIFRS","n","n","n","x","n","n","n","n"]
["App.2-CA_CGAAP_DepExp_2011","n","n","n","x","n","n","n","n"]
["App.2-CB_MIFRS_DepExp_2011","n","n","n","x","n","n","n","n"]
["App.2-CC_MIFRS_DepExp_2012","n","n","n","x","n","n","n","n"]
["App.2-CD_MIFRS_DepExp_2013","n","n","n","x","n","n","n","n"]
["App.2-CE_MIFRS_DepExp_2014","n","n","n","x","n","n","n","n"]
["App.2-CF_CGAAP_DepExp_2012","n","n","n","x","n","n","n","n"]
["App.2-CG_MIFRS_DepExp_2012","n","n","n","x","n","n","n","n"]
["App.2-CH_MIFRS_DepExp_2013","n","n","n","x","n","n","n","n"]
["App.2-CI_MIFRS_DepExp_2014","n","n","n","x","n","n","n","n"]
["App.2-CJ_CGAAP_DepExp_2012","n","n","n","x","n","n","n","n"]
["App.2-CK_CGAAP_DepExp_2013","n","n","n","x","n","n","n","n"]
["App.2-CL_MIFRS_DepExp_2013","n","n","n","x","n","n","n","n"]
["App.2-CM_MIFRS_DepExp_2014","n","n","n","x","n","n","n","n"]
["Instruction for App. 2-C CGAAP","x","x","x","n","n","x","x","x"]
["App.2-CN_OldCGAAP_DepExp_2012","x","x","n","n","n","x","x","n"]
["App.2-CO_NewCGAAP_DepExp_2012","x","x","n","n","n","x","x","n"]
["App.2-CP_NewCGAAP_DepExp_2013","x","x","n","n","n","x","x","n"]
["App.2-CQ NewCGAAP_DepExp_2014","x","x","n","n","n","x","x","n"]
["App.2-CR_OldCGAAP_DepExp_2012","x","n","x","n","n","x","n","x"]
["App.2-CS_OldCGAAP_DepExp_2013","x","n","x","n","n","x","n","x"]
["App.2-CT_NewCGAAP_DepExp_2013","x","n","x","n","n","x","n","x"]
["App.2-CU_NewCGAAP_DepExp_2014","x","n","x","n","n","x","n","x"]
["App.2-CV_USGAAP_DepExp","n","n","n","n","x","n","n","n"]
["App.2-DA_Overhead","n","n","n","x","n","n","n","n"]
["App.2-DB_Overhead","x","x","x","n","n","x","x","x"]
["App.2-EA_PP&E Deferral Account","n","n","n","x","x","n","n","n"]
["App.2-EB_PP&E Deferral Account","n","n","n","x","x","n","n","n"]
["App.2-EC_PP&E Deferral Account","n","n","n","x","x","n","n","n"]
["App.2-ED_Account 1576 (2012)","x","x","n","x","x","x","x","n"]
["App.2-EE_Account 1576 (2013)","x","n","x","x","x","x","n","x"]
["App.2-FA Proposed REG Invest.","o","o","o","o","o","o","o","o"]
["App.2-FB Calc of REG Improvemnt","o","o","o","o","o","o","o","o"]
["App.2-FC Calc of REG Expansion","o","o","o","o","o","o","o","o"]
["App.2-G SQI","x","x","x","x","x","x","x","x"]
["App.2-H_Other_Oper_Rev","x","x","x","x","x","x","x","x"]
["App.2-I LF_CDM_WF","x","x","x","x","x","x","x","x"]
["App.2-JA_OM&A_Summary_Analys","x","x","x","x","x","x","x","x"]
["App.2-JB_OM&A_Cost _Drivers","x","x","x","x","x","x","x","x"]
["App.2-JC_OMA Programs","x","x","x","x","x","x","x","x"]
["App.2-K_Employee Costs","x","x","x","x","x","x","x","x"]
["App.2-L_OM&A_per_Cust_FTEE","x","x","x","x","x","x","x","x"]
["App.2-M_Regulatory_Costs","x","x","x","x","x","x","x","x"]
["App.2-N_Corp_Cost_Allocation","x","x","x","x","x","x","x","x"]
["App.2-OA Capital Structure","x","x","x","x","x","x","x","x"]
["App.2-OB_Debt Instruments","x","x","x","x","x","x","x","x"]
["App.2-P_Cost_Allocation","x","x","x","x","x","x","x","x"]
["App.2-Q_Cost of Serv. Emb. Dx","e","e","e","e","e","e","e","e"]
["App.2-R_Loss Factors","x","x","x","x","x","x","x","x"]
["App.2-S_Stranded Meters","x","x","x","x","x","x","x","x"]
["App.2-TA_1592_Tax_Variance","x","x","x","x","x","x","x","x"]
["App.2-TB_1592_HST-OVAT","x","x","x","x","x","x","x","x"]
["App.2-U_IFRS Transition Costs","x","x","x","x","x","x","x","x"]
["App.2-V_Rev_Reconciliation","x","x","x","x","x","x","x","x"]
["App.2-W_Bill Impacts","x","x","x","x","x","x","x","x"]
["App.2-YA_MIFRS Summary Impacts","n","n","n","x","n","n","n","n"]
["App. 2-YB_CGAAP Summary Impacts","x","x","x","n","n","x","x","x"]
["App. 2-Z_Tariff","x","x","x","x","x","x","x","x"]
["lists","n","n","n","n","n","n","n","n"]
["lists2","n","n","n","n","n","n","n","n"]
["Sheet19","n","n","n","n","n","n","n","n"]

{"sheet":"App.2-YA_IFRS Transition Costs","index":39,"n_rows":34,"n_cols":15,"rows_kept":34,"cut":false,"hidden":false,"merged":[[16,0,16,2],[13,0,15,2],[13,13,15,13],[13,10,14,10],[13,12,15,12],[11,0,11,14],[13,11,14,11],[13,14,15,14],[9,0,10,14],[8,0,8,14],[28,0,28,2],[17,0,17,2],[18,0,18,2],[19,0,19,2],[20,0,20,2],[21,0,21,2],[22,0,22,2],[23,0,23,2],[24,0,24,2],[25,0,25,2],[26,0,26,2],[27,0,27,2],[44,0,45,0],[44,1,45,3],[33,0,34,0],[36,0,37,0],[36,1,37,3],[32,1,32,4],[32,5,32,6],[31,1,31,14],[33,1,33,14],[39,0,42,0],[39,1,42,3]]}
[]
[null,null,null,null,null,null,null,null,null,null,null,null,null,"File Number:",{"$f":"EBNUMBER","v":"EB-2017-0038"}]
[null,null,null,null,null,null,null,null,null,null,null,null,null,"Exhibit:",9]
[null,null,null,null,null,null,null,null,null,null,null,null,null,"Tab:",5]
[null,null,null,null,null,null,null,null,null,null,null,null,null,"Schedule:"]
[null,null,null,null,null,null,null,null,null,null,null,null,null,"Page:",13]
[]
[null,null,null,null,null,null,null,null,null,null,null,null,null,"Date:","Sept 12, 2017"]
["Appendix 2-YA"]
["One-Time Incremental IFRS Transition Costs"]
[]
["The following table should be completed based on the information requested below. An explanation should be provided for any blank entries.  The entries should include one-time incremental IFRS transition costs that are currently included in Account 1508, Other Regulatory Assets, sub-account Deferred IFRS Transition Costs Account, or Account 1508, Other Regulatory Assets, sub-account IFRS Transition Costs Variance Account."]
[]
["Nature of One-Time Incremental IFRS Transition Costs 1",null,null,null,"Audited Actual Costs Incurred","Audited Actual Costs Incurred","Audited Actual Costs Incurred","Audited Actual Costs Incurred","Audited Actual Costs Incurred","Audited Carrying Charges ","Forecasted Costs ","Forecasted Costs ","Carrying Charges January 1, 2017 to December 31, 2017 or April 30, 2018 (As appropriate)","Total Costs and Carrying Charges","Reasons why the costs recorded meet the criteria of one-time IFRS administrative incremental costs"]
[]
[null,null,null,null,2012,2013,2014,2015,"2016 3","To December 31, 2016","2017 3","2018 3"]
["Professional accounting fees",null,null,null,null,null,null,4113.24,{"$f":"29290.72+20400","v":49690.720000000001},null,null,null,789.12,{"$f":"SUM(E17:M17)","v":54593.08},"Consultant Fees related to IFRS Conversion"]
["Professional legal fees",null,null,null,null,null,null,null,null,null,null,null,{"$f":"(H18+I18)*1.1%","v":0},0]
["Salaries, wages and benefits of staff added to support the transition to IFRS",null,null,null,null,null,null,null,null,null,null,null,null,0]
["Associated staff training and development costs",null,null,null,null,null,null,16038,25771,null,null,null,613.20000000000005,42422.2,"Staff Training and conversion of new Financial System relating to IFRS converison"]
["Costs related to system upgrades, or replacements or changes where IFRS was the major reason for conversion",null,null,null,null,null,null,null,null,null,null,null,null,0]
["Financial Consulting Services",null,null,null,null,null,null,null,205000,null,null,null,3007,208007,"Support and Services related to the conversion of the 2015 and historical financial information"]
[null,null,null,null,null,null,null,null,null,null,null,null,null,0]
[null,null,null,null,null,null,null,null,null,null,null,null,null,0]
[null,null,null,null,null,null,null,null,null,null,null,null,null,0]
["Amounts, if any, included in previous Board approved rates (amounts should be negative) 2",null,null,null,null,null,null,null,null,null,null,null,null,0]
[null,null,null,null,null,null,null,null,null,null,null,null,null,0]
["Insert description of additional item(s) and new rows if needed.",null,null,null,null,null,null,null,null,null,null,null,null,0]
["Total",null,null,null,{"$f":"SUM(E17:E28)","v":0},0,null,{"$f":"SUM(H17:H28)","v":20151.239999999998},{"$f":"SUM(I17:I28)","v":280461.71999999997},0,null,0,{"$f":"SUM(M17:M28)","v":4409.32},{"$f":"SUM(N17:N28)","v":305022.28000000003}]
[]
["Note:"]
[1,"The Deferred IFRS Transition Costs Account and the IFRS Transition Costs Variance Account are exclusively for necessary, incremental transition costs and shall not include ongoing IFRS compliance costs or impacts arising from adopting accounting policy changes that reflect changes in the timing of the recognition of income. The incremental costs in these accounts shall not include costs related to system upgrades, or replacements or changes where IFRS was not the major reason for conversion. In addition, incremental IFRS costs shall not include capital assets or expenditures."]
[2,"If there were any amounts approved in previous Board approved rates, please state the EB #:"]
[3,"Any forecasted One-time costs past 2015 should be fully explained in the application, since distributors were required to adopt IFRS or an alternative accounting standard by January 1, 2015."]

{"sheet":"Sheet1","index":40,"n_rows":0,"n_cols":0,"rows_kept":0,"cut":false,"hidden":false,"merged":[]}